BDBM30396 piperidinyl glycine derivative, 27c
SMILES: CCOc1ccc(cc1)-c1ccc(s1)S(=O)(=O)N[C@H](C1CCN(CC1)S(=O)(=O)c1ccccc1)C(O)=O
InChI Key: InChIKey=WSJXJUJAODDAGQ-XMMPIXPASA-N
Data: 2 IC50
Activity Spreadsheet -- Enzyme Inhibition Constant Data from BindingDB
Found 2 hits for monomerid = 30396
Trg + Lig
Ki
nM
ΔG°
kcal/mole
IC50
nM
Kd
nM
EC50/IC50
nM
koff
s-1
kon
M-1s-1
pHTemp
°C
Interstitial collagenase
(Homo sapiens (Human))
BDBM30396
(piperidinyl glycine derivative, 27c)
Show SMILES CCOc1ccc(cc1)-c1ccc(s1)S(=O)(=O)N[C@H](C1CCN(CC1)S(=O)(=O)c1ccccc1)C(O)=O |r|
Show InChI InChI=1S/C25H28N2O7S3/c1-2-34-20-10-8-18(9-11-20)22-12-13-23(35-22)36(30,31)26-24(25(28)29)19-14-16-27(17-15-19)37(32,33)21-6-4-3-5-7-21/h3-13,19,24,26H,2,14-17H2,1H3,(H,28,29)/t24-/m1/s1
Reactome pathway
n/an/a 1.29E+4n/an/an/an/an/a25
Novartis
Assay Description
Test compounds were serially diluted in deep well plates, and an aliquot of the inhibitor solutions was transferred to a Biomek deep well plate conta...
J Med Chem 52: 3523-38 (2009)
Article DOI: 10.1021/jm801394m
BindingDB Entry DOI: 10.7270/Q2B27SN3
Collagenase 3
(Homo sapiens (Human))
BDBM30396
(piperidinyl glycine derivative, 27c)
Show SMILES CCOc1ccc(cc1)-c1ccc(s1)S(=O)(=O)N[C@H](C1CCN(CC1)S(=O)(=O)c1ccccc1)C(O)=O |r|
Show InChI InChI=1S/C25H28N2O7S3/c1-2-34-20-10-8-18(9-11-20)22-12-13-23(35-22)36(30,31)26-24(25(28)29)19-14-16-27(17-15-19)37(32,33)21-6-4-3-5-7-21/h3-13,19,24,26H,2,14-17H2,1H3,(H,28,29)/t24-/m1/s1
NCI pathway
Reactome pathway
n/an/a 0.700n/an/an/an/an/a25
Novartis
Assay Description
Test compounds were serially diluted in the assay buffer. In each well of a 96-well microtiter plate (Immunofluor B, Dynatech), the inhibitor solutio...
J Med Chem 52: 3523-38 (2009)
Article DOI: 10.1021/jm801394m
BindingDB Entry DOI: 10.7270/Q2B27SN3