null
SMILES: CCOc1ccc(cc1)-c1ccc(s1)S(=O)(=O)N[C@H](C1CCN(CC1)S(=O)(=O)C(C)C)C(O)=O
InChI Key: InChIKey=YOPWUPWVOZRKMX-OAQYLSRUSA-N
Activity Spreadsheet -- Enzyme Inhibition Constant Data from BindingDB
Found 2 hits for monomerid = 30400
Trg + Lig
Ki
nM
ΔG°
kcal/mole
IC50
nM
Kd
nM
EC50/IC50
nM
koff
s-1
kon
M-1s-1
pHTemp
°C
Interstitial collagenase
(Homo sapiens (Human))
BDBM30400
(piperidinyl glycine derivative, 27g)
Show SMILES CCOc1ccc(cc1)-c1ccc(s1)S(=O)(=O)N[C@H](C1CCN(CC1)S(=O)(=O)C(C)C)C(O)=O |r|
Show InChI InChI=1S/C22H30N2O7S3/c1-4-31-18-7-5-16(6-8-18)19-9-10-20(32-19)33(27,28)23-21(22(25)26)17-11-13-24(14-12-17)34(29,30)15(2)3/h5-10,15,17,21,23H,4,11-14H2,1-3H3,(H,25,26)/t21-/m1/s1
Reactome pathway
n/an/a>1.00E+4n/an/an/an/an/a25
Novartis
Assay Description
Test compounds were serially diluted in deep well plates, and an aliquot of the inhibitor solutions was transferred to a Biomek deep well plate conta...
J Med Chem 52: 3523-38 (2009)
Article DOI: 10.1021/jm801394m
BindingDB Entry DOI: 10.7270/Q2B27SN3
Collagenase 3
(Homo sapiens (Human))
BDBM30400
(piperidinyl glycine derivative, 27g)
Show SMILES CCOc1ccc(cc1)-c1ccc(s1)S(=O)(=O)N[C@H](C1CCN(CC1)S(=O)(=O)C(C)C)C(O)=O |r|
Show InChI InChI=1S/C22H30N2O7S3/c1-4-31-18-7-5-16(6-8-18)19-9-10-20(32-19)33(27,28)23-21(22(25)26)17-11-13-24(14-12-17)34(29,30)15(2)3/h5-10,15,17,21,23H,4,11-14H2,1-3H3,(H,25,26)/t21-/m1/s1
NCI pathway
Reactome pathway
n/an/a 4.70n/an/an/an/an/a25
Novartis
Assay Description
Test compounds were serially diluted in the assay buffer. In each well of a 96-well microtiter plate (Immunofluor B, Dynatech), the inhibitor solutio...
J Med Chem 52: 3523-38 (2009)
Article DOI: 10.1021/jm801394m
BindingDB Entry DOI: 10.7270/Q2B27SN3