BDBM304095 (R)-2-(1-((4-Carboxyphenyl)amino)-3-cyclobutyl-1-oxopropan-2-yl)-5-(3-chloro-6-(difluoromethyl)-2-fluorophenyl)pyridine 1-oxide::US10143681, Example 4
SMILES: OC(=O)c1ccc(NC(=O)[C@H](CC2CCC2)c2ccc(c[n+]2[O-])-c2c(F)c(Cl)ccc2C(F)F)cc1
InChI Key: InChIKey=QELFRIHVHVRUFC-LJQANCHMSA-N
Data: 2 IC50
Activity Spreadsheet -- Enzyme Inhibition Constant Data from BindingDB
Found 2 hits for monomerid = 304095
Trg + Lig
Ki
nM
ΔG°
kcal/mole
IC50
nM
Kd
nM
EC50/IC50
nM
koff
s-1
kon
M-1s-1
pHTemp
°C
Plasma kallikrein
(Homo sapiens (Human))
BDBM304095
((R)-2-(1-((4-Carboxyphenyl)amino)-3-cyclobutyl-1-o...)
Show SMILES OC(=O)c1ccc(NC(=O)[C@H](CC2CCC2)c2ccc(c[n+]2[O-])-c2c(F)c(Cl)ccc2C(F)F)cc1 |r|
Show InChI InChI=1S/C26H22ClF3N2O4/c27-20-10-9-18(24(29)30)22(23(20)28)16-6-11-21(32(36)13-16)19(12-14-2-1-3-14)25(33)31-17-7-4-15(5-8-17)26(34)35/h4-11,13-14,19,24H,1-3,12H2,(H,31,33)(H,34,35)/t19-/m1/s1
US Patent
n/an/a 4.70n/an/an/an/an/an/a
Merck Sharp & Dohme Corp.
US Patent
Assay Description
The effectiveness of a compound of the present invention as an inhibitor of Kallikrein can be determined using a relevant purified serine protease, a...
US Patent US10143681 (2018)
BindingDB Entry DOI: 10.7270/Q2348NG3
Coagulation factor XI
(Homo sapiens (Human))
BDBM304095
((R)-2-(1-((4-Carboxyphenyl)amino)-3-cyclobutyl-1-o...)
Show SMILES OC(=O)c1ccc(NC(=O)[C@H](CC2CCC2)c2ccc(c[n+]2[O-])-c2c(F)c(Cl)ccc2C(F)F)cc1 |r|
Show InChI InChI=1S/C26H22ClF3N2O4/c27-20-10-9-18(24(29)30)22(23(20)28)16-6-11-21(32(36)13-16)19(12-14-2-1-3-14)25(33)31-17-7-4-15(5-8-17)26(34)35/h4-11,13-14,19,24H,1-3,12H2,(H,31,33)(H,34,35)/t19-/m1/s1
Reactome pathway
US Patent
n/an/a 0.360n/an/an/an/an/an/a
Merck Sharp & Dohme Corp.
US Patent
Assay Description
The effectiveness of a compound of the present invention as an inhibitor of Coagulation Factor XIa can be determined using a relevant purified serine...
US Patent US10143681 (2018)
BindingDB Entry DOI: 10.7270/Q2348NG3