BDBM30416 pyrrolo[1,2-b]pyridazin-2-one analog., 3i
SMILES: CN(c1ccc2N=C(NS(=O)(=O)c2c1)c1c(O)c2cccn2n(CCC(C)(C)C)c1=O)S(C)(=O)=O
InChI Key: InChIKey=CYPJQCGMZVPHMX-UHFFFAOYSA-N
Data: 1 IC50  1 EC50
Activity Spreadsheet -- Enzyme Inhibition Constant Data from BindingDB
Found 1 hit for monomerid = 30416
Trg + Lig
Ki
nM
ΔG°
kcal/mole
IC50
nM
Kd
nM
EC50/IC50
nM
koff
s-1
kon
M-1s-1
pHTemp
°C
Non-structural protein 5B (NS5B)
(Hepatitis C virus genotype 1b (isolate BK) (HCV))
BDBM30416
(pyrrolo[1,2-b]pyridazin-2-one analog., 3i)
Show SMILES CN(c1ccc2N=C(NS(=O)(=O)c2c1)c1c(O)c2cccn2n(CCC(C)(C)C)c1=O)S(C)(=O)=O |c:6|
Show InChI InChI=1S/C22H27N5O6S2/c1-22(2,3)10-12-27-21(29)18(19(28)16-7-6-11-26(16)27)20-23-15-9-8-14(25(4)34(5,30)31)13-17(15)35(32,33)24-20/h6-9,11,13,28H,10,12H2,1-5H3,(H,23,24)
n/an/a 60n/a 120n/an/a7.528
Anadys Pharmaceuticals
Assay Description
Assays were performed in a 96-well streptavidin-coated Flash-Plate using enzyme, RNA substrate, and [alpha-33P]GTP/GTP with inhibitor concentration v...
Bioorg Med Chem Lett 18: 3616-21 (2008)
Article DOI: 10.1016/j.bmcl.2008.04.066
BindingDB Entry DOI: 10.7270/Q26D5R9N