BDBM304339 US10143668, Compound 1b
SMILES: CCCCCCCCCCCCCCN(C)CC(=O)N(C)C[C@H](O)[C@@H](O)[C@H](O)[C@H](O)CO
InChI Key: InChIKey=FJSGCQBODOTQBT-XWVZOOPGSA-N
Data: 1 IC50
Activity Spreadsheet -- Enzyme Inhibition Constant Data from BindingDB
Found 1 hit for monomerid = 304339
Trg + Lig
Ki
nM
ΔG°
kcal/mole
IC50
nM
Kd
nM
EC50/IC50
nM
koff
s-1
kon
M-1s-1
pHTemp
°C
Beta-hexosaminidase subunit beta (Hex B)
(Homo sapiens (Human))
BDBM304339
(US10143668, Compound 1b)
Show SMILES CCCCCCCCCCCCCCN(C)CC(=O)N(C)C[C@H](O)[C@@H](O)[C@H](O)[C@H](O)CO |r|
Show InChI InChI=1S/C24H50N2O6/c1-4-5-6-7-8-9-10-11-12-13-14-15-16-25(2)18-22(30)26(3)17-20(28)23(31)24(32)21(29)19-27/h20-21,23-24,27-29,31-32H,4-19H2,1-3H3/t20-,21+,23+,24+/m0/s1
Reactome pathway
US Patent
n/an/a 4.90E+3n/an/an/an/an/an/a
GRI BIO, INC.
US Patent
Assay Description
Buffers and solutions: Phosphate buffered saline (PBS) and 1 M HEPES were provided by the in-house service facility. Tyrode's buffer (TyB) consis...
US Patent US10143668 (2018)
BindingDB Entry DOI: 10.7270/Q2K35WQ0