BDBM30450 hexahydro-pyrrolo[1,2-b]pyridazin-2-one, 4a
SMILES: CS(=O)(=O)Nc1ccc2N=C(NS(=O)(=O)c2c1)C1C(=O)C2CCCN2N(Cc2ccc(F)cc2)C1=O
InChI Key: InChIKey=PZZVTAWJRAJCPD-UHFFFAOYSA-N
Data: 1 IC50  1 EC50
Activity Spreadsheet -- Enzyme Inhibition Constant Data from BindingDB
Found 1 hit for monomerid = 30450
Trg + Lig
Ki
nM
ΔG°
kcal/mole
IC50
nM
Kd
nM
EC50/IC50
nM
koff
s-1
kon
M-1s-1
pHTemp
°C
Non-structural protein 5B (NS5B)
(Hepatitis C virus genotype 1b (isolate BK) (HCV))
BDBM30450
(hexahydro-pyrrolo[1,2-b]pyridazin-2-one, 4a)
Show SMILES CS(=O)(=O)Nc1ccc2N=C(NS(=O)(=O)c2c1)C1C(=O)C2CCCN2N(Cc2ccc(F)cc2)C1=O |c:9|
Show InChI InChI=1S/C22H22FN5O6S2/c1-35(31,32)25-15-8-9-16-18(11-15)36(33,34)26-21(24-16)19-20(29)17-3-2-10-27(17)28(22(19)30)12-13-4-6-14(23)7-5-13/h4-9,11,17,19,25H,2-3,10,12H2,1H3,(H,24,26)
n/an/a<10n/a 190n/an/a7.528
Anadys Pharmaceuticals
Assay Description
Assays were performed in a 96-well streptavidin-coated Flash-Plate using enzyme, RNA substrate, and [alpha-33P]GTP/GTP with inhibitor concentration v...
Bioorg Med Chem Lett 18: 5002-5 (2008)
Article DOI: 10.1016/j.bmcl.2008.08.017
BindingDB Entry DOI: 10.7270/Q2XW4H5X