BDBM304734 (R)-3-(1,4-dimethyl-1H-benzo[d][1,2,3]triazol-5-yl)-3-(4-methyl-3-(((R)-4-methyl-1,1-dioxido-3,4-dihydro-2H-benzo[b][1,4,5]oxathiazepin-2-yl)methyl)phenyl)propanoic acid::US10144731, Example 20
SMILES: C[C@@H]1CN(Cc2cc(ccc2C)[C@@H](CC(O)=O)c2ccc3n(C)nnc3c2C)S(=O)(=O)c2ccccc2O1
InChI Key: InChIKey=HKVJGRGOCHBUFK-WZONZLPQSA-N
Data: 1 IC50  1 EC50
Activity Spreadsheet -- Enzyme Inhibition Constant Data from BindingDB
Found 2 hits for monomerid = 304734
Trg + Lig
Ki
nM
ΔG°
kcal/mole
IC50
nM
Kd
nM
EC50/IC50
nM
koff
s-1
kon
M-1s-1
pHTemp
°C
Keap1 (aa 321-609)
(Homo sapiens (Human))
BDBM304734
((R)-3-(1,4-dimethyl-1H-benzo[d][1,2,3]triazol-5-yl...)
Show SMILES C[C@@H]1CN(Cc2cc(ccc2C)[C@@H](CC(O)=O)c2ccc3n(C)nnc3c2C)S(=O)(=O)c2ccccc2O1 |r|
Show InChI InChI=1S/C28H30N4O5S/c1-17-9-10-20(23(14-27(33)34)22-11-12-24-28(19(22)3)29-30-31(24)4)13-21(17)16-32-15-18(2)37-25-7-5-6-8-26(25)38(32,35)36/h5-13,18,23H,14-16H2,1-4H3,(H,33,34)/t18-,23-/m1/s1
US Patent
n/an/a<10n/an/an/an/an/an/a
GlaxoSmithKline Intellectual Property Development Limited; Astex Therapeutics, Ltd
US Patent
Assay Description
100 nL of 100× compound dose response curves (serial 3-fold dilutions) in DMSO are stamped using an Echo liquid handling system (Labcyte) into 384-we...
US Patent US10144731 (2018)
BindingDB Entry DOI: 10.7270/Q25X2C17
Kelch-like ECH-associated protein 1
(Homo sapiens (Human))
BDBM304734
((R)-3-(1,4-dimethyl-1H-benzo[d][1,2,3]triazol-5-yl...)
Show SMILES C[C@@H]1CN(Cc2cc(ccc2C)[C@@H](CC(O)=O)c2ccc3n(C)nnc3c2C)S(=O)(=O)c2ccccc2O1 |r|
Show InChI InChI=1S/C28H30N4O5S/c1-17-9-10-20(23(14-27(33)34)22-11-12-24-28(19(22)3)29-30-31(24)4)13-21(17)16-32-15-18(2)37-25-7-5-6-8-26(25)38(32,35)36/h5-13,18,23H,14-16H2,1-4H3,(H,33,34)/t18-,23-/m1/s1
US Patent
n/an/an/an/a 55n/an/an/an/a
GlaxoSmithKline Intellectual Property Development Limited; Astex Therapeutics, Ltd
US Patent
Assay Description
NAD(P)H:quinone oxidoreductase 1 (NQO1), also called DT diaphorase, is a homodimeric FAD-containing enzyme that catalyzes obligatory NAD(P)H-dependen...
US Patent US10144731 (2018)
BindingDB Entry DOI: 10.7270/Q25X2C17