BDBM30481 1,1-dioxoisothiazole analog., 25
SMILES: CCOc1cccc2C(NS(=O)(=O)c12)=C1C(=O)[C@H](C2CCCCC2)N(CCC(C)(C)C)C1=O
InChI Key: InChIKey=CCCUZGYKHDHQAB-NRFANRHFSA-N
Data: 1 IC50
Activity Spreadsheet -- Enzyme Inhibition Constant Data from BindingDB
Found 1 hit for monomerid = 30481
Trg + Lig
Ki
nM
ΔG°
kcal/mole
IC50
nM
Kd
nM
EC50/IC50
nM
koff
s-1
kon
M-1s-1
pHTemp
°C
Non-structural protein 5B (NS5B)
(Hepatitis C virus genotype 1b (isolate BK) (HCV))
BDBM30481
(1,1-dioxoisothiazole analog., 25)
Show SMILES CCOc1cccc2C(NS(=O)(=O)c12)=C1C(=O)[C@H](C2CCCCC2)N(CCC(C)(C)C)C1=O |r,w:14.16|
Show InChI InChI=1S/C25H34N2O5S/c1-5-32-18-13-9-12-17-20(26-33(30,31)23(17)18)19-22(28)21(16-10-7-6-8-11-16)27(24(19)29)15-14-25(2,3)4/h9,12-13,16,21,26H,5-8,10-11,14-15H2,1-4H3/t21-/m0/s1
n/an/a 4.00E+3n/an/an/an/a7.528
Anadys Pharmaceuticals
Assay Description
Assays were performed in a 96-well streptavidin-coated Flash-Plate using enzyme, RNA substrate, and [alpha-33P]GTP/GTP with inhibitor concentration v...
Bioorg Med Chem Lett 18: 4181-5 (2008)
Article DOI: 10.1016/j.bmcl.2008.05.083
BindingDB Entry DOI: 10.7270/Q2PC30Q5