BDBM30485 1,1-dioxoisothiazole analog., 29
SMILES: CCOc1cccc2C(NS(=O)(=O)c12)=C1C(=O)[C@@H](N(CCC(C)C)C1=O)C(C)(C)C
InChI Key: InChIKey=WOXUMXXCOWJRBM-HXUWFJFHSA-N
Data: 1 IC50
Activity Spreadsheet -- Enzyme Inhibition Constant Data from BindingDB
Found 1 hit for monomerid = 30485
Trg + Lig
Ki
nM
ΔG°
kcal/mole
IC50
nM
Kd
nM
EC50/IC50
nM
koff
s-1
kon
M-1s-1
pHTemp
°C
Non-structural protein 5B (NS5B)
(Hepatitis C virus genotype 1b (isolate BK) (HCV))
BDBM30485
(1,1-dioxoisothiazole analog., 29)
Show SMILES CCOc1cccc2C(NS(=O)(=O)c12)=C1C(=O)[C@@H](N(CCC(C)C)C1=O)C(C)(C)C |r,w:14.16|
Show InChI InChI=1S/C22H30N2O5S/c1-7-29-15-10-8-9-14-17(23-30(27,28)19(14)15)16-18(25)20(22(4,5)6)24(21(16)26)12-11-13(2)3/h8-10,13,20,23H,7,11-12H2,1-6H3/t20-/m1/s1
n/an/a 5.10E+3n/an/an/an/a7.528
Anadys Pharmaceuticals
Assay Description
Assays were performed in a 96-well streptavidin-coated Flash-Plate using enzyme, RNA substrate, and [alpha-33P]GTP/GTP with inhibitor concentration v...
Bioorg Med Chem Lett 18: 4181-5 (2008)
Article DOI: 10.1016/j.bmcl.2008.05.083
BindingDB Entry DOI: 10.7270/Q2PC30Q5