BDBM304887 3-(3-(((R)-4-ethyl-1,1-dioxido-3,4-dihydro-2H-benzo[b][1,4,5]oxathiazepin-2-yl)methyl)-4-methylphenyl)-5-(1-ethyl-1H-1,2,3-triazol-4-yl)-2-methylpentanoic acid::US10144731, Example 192
SMILES: CC[C@@H]1CN(Cc2cc(ccc2C)C(CCc2cn(CC)nn2)C(C)C(O)=O)S(=O)(=O)c2ccccc2O1
InChI Key: InChIKey=IDANVQJFZXIQGM-FMGHMSBISA-N
Data: 1 IC50  1 EC50
Activity Spreadsheet -- Enzyme Inhibition Constant Data from BindingDB
Found 2 hits for monomerid = 304887
Trg + Lig
Ki
nM
ΔG°
kcal/mole
IC50
nM
Kd
nM
EC50/IC50
nM
koff
s-1
kon
M-1s-1
pHTemp
°C
Keap1 (aa 321-609)
(Homo sapiens (Human))
BDBM304887
(3-(3-(((R)-4-ethyl-1,1-dioxido-3,4-dihydro-2H-benz...)
Show SMILES CC[C@@H]1CN(Cc2cc(ccc2C)C(CCc2cn(CC)nn2)C(C)C(O)=O)S(=O)(=O)c2ccccc2O1 |r,w:14.14,23.25|
Show InChI InChI=1S/C28H36N4O5S/c1-5-24-18-32(38(35,36)27-10-8-7-9-26(27)37-24)16-22-15-21(12-11-19(22)3)25(20(4)28(33)34)14-13-23-17-31(6-2)30-29-23/h7-12,15,17,20,24-25H,5-6,13-14,16,18H2,1-4H3,(H,33,34)/t20?,24-,25?/m1/s1
US Patent
n/an/a<10n/an/an/an/an/an/a
GlaxoSmithKline Intellectual Property Development Limited; Astex Therapeutics, Ltd
US Patent
Assay Description
100 nL of 100× compound dose response curves (serial 3-fold dilutions) in DMSO are stamped using an Echo liquid handling system (Labcyte) into 384-we...
US Patent US10144731 (2018)
BindingDB Entry DOI: 10.7270/Q25X2C17
Kelch-like ECH-associated protein 1
(Homo sapiens (Human))
BDBM304887
(3-(3-(((R)-4-ethyl-1,1-dioxido-3,4-dihydro-2H-benz...)
Show SMILES CC[C@@H]1CN(Cc2cc(ccc2C)C(CCc2cn(CC)nn2)C(C)C(O)=O)S(=O)(=O)c2ccccc2O1 |r,w:14.14,23.25|
Show InChI InChI=1S/C28H36N4O5S/c1-5-24-18-32(38(35,36)27-10-8-7-9-26(27)37-24)16-22-15-21(12-11-19(22)3)25(20(4)28(33)34)14-13-23-17-31(6-2)30-29-23/h7-12,15,17,20,24-25H,5-6,13-14,16,18H2,1-4H3,(H,33,34)/t20?,24-,25?/m1/s1
US Patent
n/an/an/an/a<10n/an/an/an/a
GlaxoSmithKline Intellectual Property Development Limited; Astex Therapeutics, Ltd
US Patent
Assay Description
NAD(P)H:quinone oxidoreductase 1 (NQO1), also called DT diaphorase, is a homodimeric FAD-containing enzyme that catalyzes obligatory NAD(P)H-dependen...
US Patent US10144731 (2018)
BindingDB Entry DOI: 10.7270/Q25X2C17