null
SMILES: CC(C)(C)CCN1[C@H](C(=O)C(C1=O)=C1NS(=O)(=O)c2c1cccc2OCC(N)=O)C(C)(C)C
InChI Key: InChIKey=QRSYSBUHCWUUJV-HXUWFJFHSA-N
Activity Spreadsheet -- Enzyme Inhibition Constant Data from BindingDB
Found 1 hit for monomerid = 30493
Trg + Lig
Ki
nM
ΔG°
kcal/mole
IC50
nM
Kd
nM
EC50/IC50
nM
koff
s-1
kon
M-1s-1
pHTemp
°C
Genome polyprotein
(Hepatitis C virus genotype 1b (isolate BK) (HCV))
BDBM30493
(1,1-dioxoisothiazole analog., 37)
Show SMILES CC(C)(C)CCN1[C@H](C(=O)C(C1=O)=C1NS(=O)(=O)c2c1cccc2OCC(N)=O)C(C)(C)C |r,w:10.9|
Show InChI InChI=1S/C23H31N3O6S/c1-22(2,3)10-11-26-20(23(4,5)6)18(28)16(21(26)29)17-13-8-7-9-14(32-12-15(24)27)19(13)33(30,31)25-17/h7-9,20,25H,10-12H2,1-6H3,(H2,24,27)/t20-/m1/s1
n/an/a 200n/a 1.10E+4n/an/a7.528
Anadys Pharmaceuticals
Assay Description
Assays were performed in a 96-well streptavidin-coated Flash-Plate using enzyme, RNA substrate, and [alpha-33P]GTP/GTP with inhibitor concentration v...
Bioorg Med Chem Lett 18: 4181-5 (2008)
Article DOI: 10.1016/j.bmcl.2008.05.083
BindingDB Entry DOI: 10.7270/Q2PC30Q5