BDBM30517 5,6-Dihydro-1H-pyridin-2-one, 4q
SMILES: CS(=O)(=O)Nc1ccc2N=C(NS(=O)(=O)c2c1)C1C(=O)C2CCCC2N(CCC2CC2)C1=O
InChI Key: InChIKey=DHVZXALTQYQBMW-UHFFFAOYSA-N
Data: 2 IC50  1 EC50
Activity Spreadsheet -- Enzyme Inhibition Constant Data from BindingDB
Found 2 hits for monomerid = 30517
Trg + Lig
Ki
nM
ΔG°
kcal/mole
IC50
nM
Kd
nM
EC50/IC50
nM
koff
s-1
kon
M-1s-1
pHTemp
°C
HCV NS3-NS4A Serine Proteinase
(Hepatitis C virus (HCV genotype 1a, isolate H))
BDBM30517
(5,6-Dihydro-1H-pyridin-2-one, 4q)
Show SMILES CS(=O)(=O)Nc1ccc2N=C(NS(=O)(=O)c2c1)C1C(=O)C2CCCC2N(CCC2CC2)C1=O |c:9|
Show InChI InChI=1S/C21H26N4O6S2/c1-32(28,29)23-13-7-8-15-17(11-13)33(30,31)24-20(22-15)18-19(26)14-3-2-4-16(14)25(21(18)27)10-9-12-5-6-12/h7-8,11-12,14,16,18,23H,2-6,9-10H2,1H3,(H,22,24)
n/an/a 51n/an/an/an/an/an/a
Anadys Pharmaceuticals
Assay Description
Assays were performed in a 96-well streptavidin-coated Flash-Plate using enzyme (NS5B H77 1a), RNA substrate, and [alpha-33P]GTP/GTP with inhibitor c...
Bioorg Med Chem Lett 19: 451-8 (2009)
Article DOI: 10.1016/j.bmcl.2008.11.048
BindingDB Entry DOI: 10.7270/Q2JM27Z0
Non-structural protein 5B (NS5B)
(Hepatitis C virus genotype 1b (isolate BK) (HCV))
BDBM30517
(5,6-Dihydro-1H-pyridin-2-one, 4q)
Show SMILES CS(=O)(=O)Nc1ccc2N=C(NS(=O)(=O)c2c1)C1C(=O)C2CCCC2N(CCC2CC2)C1=O |c:9|
Show InChI InChI=1S/C21H26N4O6S2/c1-32(28,29)23-13-7-8-15-17(11-13)33(30,31)24-20(22-15)18-19(26)14-3-2-4-16(14)25(21(18)27)10-9-12-5-6-12/h7-8,11-12,14,16,18,23H,2-6,9-10H2,1H3,(H,22,24)
n/an/a 35n/a 120n/an/a7.528
Anadys Pharmaceuticals
Assay Description
Assays were performed in a 96-well streptavidin-coated Flash-Plate using enzyme, RNA substrate, and [alpha-33P]GTP/GTP with inhibitor concentration v...
Bioorg Med Chem Lett 19: 451-8 (2009)
Article DOI: 10.1016/j.bmcl.2008.11.048
BindingDB Entry DOI: 10.7270/Q2JM27Z0