BDBM30530 5,6-Dihydro-1H-pyridin-2-one, 4ad
SMILES: [H][C@]12CCC[C@@]1([H])C(=O)C(C(=O)N2Cc1ccc(F)cc1)C1=Nc2ccc(NS(C)(=O)=O)cc2S(=O)(=O)N1
InChI Key: InChIKey=XPLSTKZOPNUQDF-MARPTJLWSA-N
Data: 2 IC50  1 EC50
Activity Spreadsheet -- Enzyme Inhibition Constant Data from BindingDB
Found 2 hits for monomerid = 30530
Trg + Lig
Ki
nM
ΔG°
kcal/mole
IC50
nM
Kd
nM
EC50/IC50
nM
koff
s-1
kon
M-1s-1
pHTemp
°C
HCV NS3-NS4A Serine Proteinase
(Hepatitis C virus (HCV genotype 1a, isolate H))
BDBM30530
(5,6-Dihydro-1H-pyridin-2-one, 4ad)
Show SMILES [H][C@]12CCC[C@@]1([H])C(=O)C(C(=O)N2Cc1ccc(F)cc1)C1=Nc2ccc(NS(C)(=O)=O)cc2S(=O)(=O)N1 |r,t:24|
Show InChI InChI=1S/C23H23FN4O6S2/c1-35(31,32)26-15-9-10-17-19(11-15)36(33,34)27-22(25-17)20-21(29)16-3-2-4-18(16)28(23(20)30)12-13-5-7-14(24)8-6-13/h5-11,16,18,20,26H,2-4,12H2,1H3,(H,25,27)/t16-,18+,20?/m1/s1
n/an/a<25n/an/an/an/an/an/a
Anadys Pharmaceuticals
Assay Description
Assays were performed in a 96-well streptavidin-coated Flash-Plate using enzyme (NS5B H77 1a), RNA substrate, and [alpha-33P]GTP/GTP with inhibitor c...
Bioorg Med Chem Lett 19: 451-8 (2009)
Article DOI: 10.1016/j.bmcl.2008.11.048
BindingDB Entry DOI: 10.7270/Q2JM27Z0
Non-structural protein 5B (NS5B)
(Hepatitis C virus genotype 1b (isolate BK) (HCV))
BDBM30530
(5,6-Dihydro-1H-pyridin-2-one, 4ad)
Show SMILES [H][C@]12CCC[C@@]1([H])C(=O)C(C(=O)N2Cc1ccc(F)cc1)C1=Nc2ccc(NS(C)(=O)=O)cc2S(=O)(=O)N1 |r,t:24|
Show InChI InChI=1S/C23H23FN4O6S2/c1-35(31,32)26-15-9-10-17-19(11-15)36(33,34)27-22(25-17)20-21(29)16-3-2-4-18(16)28(23(20)30)12-13-5-7-14(24)8-6-13/h5-11,16,18,20,26H,2-4,12H2,1H3,(H,25,27)/t16-,18+,20?/m1/s1
n/an/a<10n/a 16n/an/a7.528
Anadys Pharmaceuticals
Assay Description
Assays were performed in a 96-well streptavidin-coated Flash-Plate using enzyme, RNA substrate, and [alpha-33P]GTP/GTP with inhibitor concentration v...
Bioorg Med Chem Lett 19: 451-8 (2009)
Article DOI: 10.1016/j.bmcl.2008.11.048
BindingDB Entry DOI: 10.7270/Q2JM27Z0