BDBM30538 5,6-Dihydro-1H-pyridin-2-one, 4aj
SMILES: [H][C@]12CCC[C@@]1([H])C(=O)C(C(=O)N2CCC(C)(C)C)C1=Nc2ccc(NS(C)(=O)=O)cc2S(=O)(=O)N1
InChI Key: InChIKey=VNPGKACHYOXFDZ-HMZVSMPESA-N
Data: 2 IC50  1 EC50
Activity Spreadsheet -- Enzyme Inhibition Constant Data from BindingDB
Found 2 hits for monomerid = 30538
Trg + Lig
Ki
nM
ΔG°
kcal/mole
IC50
nM
Kd
nM
EC50/IC50
nM
koff
s-1
kon
M-1s-1
pHTemp
°C
HCV NS3-NS4A Serine Proteinase
(Hepatitis C virus (HCV genotype 1a, isolate H))
BDBM30538
(5,6-Dihydro-1H-pyridin-2-one, 4aj)
Show SMILES [H][C@]12CCC[C@@]1([H])C(=O)C(C(=O)N2CCC(C)(C)C)C1=Nc2ccc(NS(C)(=O)=O)cc2S(=O)(=O)N1 |r,t:21|
Show InChI InChI=1S/C22H30N4O6S2/c1-22(2,3)10-11-26-16-7-5-6-14(16)19(27)18(21(26)28)20-23-15-9-8-13(24-33(4,29)30)12-17(15)34(31,32)25-20/h8-9,12,14,16,18,24H,5-7,10-11H2,1-4H3,(H,23,25)/t14-,16+,18?/m1/s1
n/an/a<25n/an/an/an/an/an/a
Anadys Pharmaceuticals
Assay Description
Assays were performed in a 96-well streptavidin-coated Flash-Plate using enzyme (NS5B H77 1a), RNA substrate, and [alpha-33P]GTP/GTP with inhibitor c...
Bioorg Med Chem Lett 19: 451-8 (2009)
Article DOI: 10.1016/j.bmcl.2008.11.048
BindingDB Entry DOI: 10.7270/Q2JM27Z0
Non-structural protein 5B (NS5B)
(Hepatitis C virus genotype 1b (isolate BK) (HCV))
BDBM30538
(5,6-Dihydro-1H-pyridin-2-one, 4aj)
Show SMILES [H][C@]12CCC[C@@]1([H])C(=O)C(C(=O)N2CCC(C)(C)C)C1=Nc2ccc(NS(C)(=O)=O)cc2S(=O)(=O)N1 |r,t:21|
Show InChI InChI=1S/C22H30N4O6S2/c1-22(2,3)10-11-26-16-7-5-6-14(16)19(27)18(21(26)28)20-23-15-9-8-13(24-33(4,29)30)12-17(15)34(31,32)25-20/h8-9,12,14,16,18,24H,5-7,10-11H2,1-4H3,(H,23,25)/t14-,16+,18?/m1/s1
n/an/a<10n/a 9n/an/an/an/a
Anadys Pharmaceuticals
Assay Description
Assays were performed in a 96-well streptavidin-coated Flash-Plate using enzyme, RNA substrate, and [alpha-33P]GTP/GTP with inhibitor concentration v...
Bioorg Med Chem Lett 19: 451-8 (2009)
Article DOI: 10.1016/j.bmcl.2008.11.048
BindingDB Entry DOI: 10.7270/Q2JM27Z0