BDBM306678 (+-)-N-[(6-amino-2,4-dimethyl- pyridin-3-yl)methyl]-12-(2,4- difluorophenyl)-11-ethenyl-15- oxatetracyclo[6.6.1.02,7.09,14] pentadeca-2,4,6,9,11,13- hexaene-4-carboxamide and (+-)-N-[(6-amino-2,4- dimethylpyridin-3-yl)methyl]- 11-(2,4-difluorophenyl)-12- ethenyl-15-oxatetraoyclo [6.6.1.02,7.09,14]pentadeca- 2,4,6,9,11,13-hexaene-4- carboxamide::US10144746, Compound 322
SMILES: Cc1cc(N)nc(C)c1CNC(=O)c1ccc2C3OC(c2c1)c1cc(c(C=C)cc31)-c1ccc(F)cc1F
InChI Key: InChIKey=JOLPUACDVQAJDV-UHFFFAOYSA-N
Data: 1 IC50
Activity Spreadsheet -- Enzyme Inhibition Constant Data from BindingDB
Found 1 hit for monomerid = 306678
Trg + Lig
Ki
nM
ΔG°
kcal/mole
IC50
nM
Kd
nM
EC50/IC50
nM
koff
s-1
kon
M-1s-1
pHTemp
°C
Plasma kallikrein
(Homo sapiens (Human))
BDBM306678
((+-)-N-[(6-amino-2,4-dimethyl- pyridin-3-yl)methyl...)
Show SMILES Cc1cc(N)nc(C)c1CNC(=O)c1ccc2C3OC(c2c1)c1cc(c(C=C)cc31)-c1ccc(F)cc1F
Show InChI InChI=1S/C31H25F2N3O2/c1-4-17-10-24-25(13-22(17)20-8-6-19(32)12-27(20)33)30-23-11-18(5-7-21(23)29(24)38-30)31(37)35-14-26-15(2)9-28(34)36-16(26)3/h4-13,29-30H,1,14H2,2-3H3,(H2,34,36)(H,35,37)
US Patent
n/an/a 2.69n/an/an/an/an/an/a
Global Blood Therapeutics, Inc.
US Patent
Assay Description
The chromogenic substrate D-Pro-Phe-Arg-pNa, 2HCl (BIOPHEN CS-31(02) from Hyphen BioMed, Neuville-Sur-oise, France) was dissolved in 5 mL deionized w...
US Patent US10144746 (2018)
BindingDB Entry DOI: 10.7270/Q2J38VNH