null
SMILES: Nc1c(C#N)c2nc3ccccc3nc2n1CCOC(=O)c1ccc(Cl)cc1
InChI Key: InChIKey=BTHBBLZEGFZFSM-UHFFFAOYSA-N
Activity Spreadsheet -- Enzyme Inhibition Constant Data from BindingDB
Found 4 hits for monomerid = 30737
Trg + Lig
Ki
nM
ΔG°
kcal/mole
IC50
nM
Kd
nM
EC50/IC50
nM
koff
s-1
kon
M-1s-1
pHTemp
°C
5-hydroxytryptamine receptor 1A
(Homo sapiens (Human))
BDBM30737
(2-(2-amino-3-cyanopyrrolo[3,2-b]quinoxalin-1-yl)et...)
Show SMILES Nc1c(C#N)c2nc3ccccc3nc2n1CCOC(=O)c1ccc(Cl)cc1
Show InChI InChI=1S/C20H14ClN5O2/c21-13-7-5-12(6-8-13)20(27)28-10-9-26-18(23)14(11-22)17-19(26)25-16-4-2-1-3-15(16)24-17/h1-8H,9-10,23H2
PCBioAssay
n/an/an/an/a 2.34E+4n/an/a7.423
The Scripps Research Institute Molecular Screening Center
Curated by PubChem BioAssay
Assay Description
A cell line containing the human 5-HT1a receptor, the promiscuous G-alpha-15 protein (Ga15) as well as the beta-lactamase (BLA) reporter-gene under c...
PubChem Bioassay (2007)
BindingDB Entry DOI: 10.7270/Q21N7ZG0
Importin subunit alpha-1
(Homo sapiens (Human))
BDBM30737
(2-(2-amino-3-cyanopyrrolo[3,2-b]quinoxalin-1-yl)et...)
Show SMILES Nc1c(C#N)c2nc3ccccc3nc2n1CCOC(=O)c1ccc(Cl)cc1
Show InChI InChI=1S/C20H14ClN5O2/c21-13-7-5-12(6-8-13)20(27)28-10-9-26-18(23)14(11-22)17-19(26)25-16-4-2-1-3-15(16)24-17/h1-8H,9-10,23H2
Reactome pathway
PCBioAssay
n/an/an/an/a 3.73E+3n/an/an/an/a
Broad Institute
Curated by PubChem BioAssay
Assay Description
Keywords: Counterscreen, FRET assay, HTS, YIC probe, Dose response, Assay Overview: This is a fluorescence resonance energy transfer (FRET)-based b...
PubChem Bioassay (2010)
BindingDB Entry DOI: 10.7270/Q280513R
Protein RecA
(Mycobacterium tuberculosis H37Rv)
BDBM30737
(2-(2-amino-3-cyanopyrrolo[3,2-b]quinoxalin-1-yl)et...)
Show SMILES Nc1c(C#N)c2nc3ccccc3nc2n1CCOC(=O)c1ccc(Cl)cc1
Show InChI InChI=1S/C20H14ClN5O2/c21-13-7-5-12(6-8-13)20(27)28-10-9-26-18(23)14(11-22)17-19(26)25-16-4-2-1-3-15(16)24-17/h1-8H,9-10,23H2
PCBioAssay
n/an/an/an/a 1.80E+3n/an/an/an/a
Broad Institute
Curated by PubChem BioAssay
Assay Description
Keywords: GFP-RecA intein, protein splicing, refolding, reducing reagent, GFP fluorescence Assay Overview: M. tuberculosis harbors three inteins, whi...
PubChem Bioassay (2010)
BindingDB Entry DOI: 10.7270/Q2DR2SX9
Protein RecA
(Mycobacterium tuberculosis H37Rv)
BDBM30737
(2-(2-amino-3-cyanopyrrolo[3,2-b]quinoxalin-1-yl)et...)
Show SMILES Nc1c(C#N)c2nc3ccccc3nc2n1CCOC(=O)c1ccc(Cl)cc1
Show InChI InChI=1S/C20H14ClN5O2/c21-13-7-5-12(6-8-13)20(27)28-10-9-26-18(23)14(11-22)17-19(26)25-16-4-2-1-3-15(16)24-17/h1-8H,9-10,23H2
PCBioAssay
n/an/an/an/a 2.69E+3n/an/an/an/a
Broad Institute
Curated by PubChem BioAssay
Assay Description
Keywords: GFP, refolding, reducing reagent, GFP fluorescence Assay Overview: M. tuberculosis harbors three inteins, which interrupt the DnaB, RecA, a...
PubChem Bioassay (2010)
BindingDB Entry DOI: 10.7270/Q2FN14NR