BDBM307408 US10150728, Example I-637
SMILES: C[C@@H](CO[C@H]1CC[C@@H](CC1)Oc1nc2c(F)cc(OCC(F)F)c(Cl)c2n1C)NC(C)=O
InChI Key: InChIKey=UDHFGURHVVRKEM-UBHSHLNASA-N
Data: 1 IC50
Activity Spreadsheet -- Enzyme Inhibition Constant Data from BindingDB
Found 1 hit for monomerid = 307408
Trg + Lig
Ki
nM
ΔG°
kcal/mole
IC50
nM
Kd
nM
EC50/IC50
nM
koff
s-1
kon
M-1s-1
pHTemp
°C
Acetyl-CoA carboxylase 2
(Homo sapiens (Human))
BDBM307408
(US10150728, Example I-637)
Show SMILES C[C@@H](CO[C@H]1CC[C@@H](CC1)Oc1nc2c(F)cc(OCC(F)F)c(Cl)c2n1C)NC(C)=O |r,wU:7.10,1.0,wD:4.3,(7.35,-2.65,;7.35,-1.11,;6.02,-.34,;4.68,-1.11,;3.35,-.34,;3.35,1.2,;2.02,1.97,;.68,1.2,;.68,-.34,;2.02,-1.11,;-.65,1.97,;-1.98,1.2,;-2.15,-.33,;-3.65,-.65,;-4.42,-1.98,;-3.65,-3.32,;-5.96,-1.98,;-6.73,-.65,;-8.27,-.65,;-9.04,-1.98,;-10.58,-1.98,;-11.35,-3.32,;-11.35,-.65,;-5.96,.68,;-6.73,2.02,;-4.42,.68,;-3.39,1.83,;-3.79,3.32,;8.68,-.34,;10.02,-1.11,;11.35,-.34,;10.02,-2.65,)|
Show InChI InChI=1S/C21H27ClF3N3O4/c1-11(26-12(2)29)9-30-13-4-6-14(7-5-13)32-21-27-19-15(23)8-16(31-10-17(24)25)18(22)20(19)28(21)3/h8,11,13-14,17H,4-7,9-10H2,1-3H3,(H,26,29)/t11-,13-,14-/m0/s1
Reactome pathway
US Patent
n/an/a 4n/an/an/an/an/an/a
SHIONOGI & CO., LTD.
US Patent
Assay Description
Recombinant human ACC1 and recombinant human ACC2, which were prepared by the method mentioned above, were preincubated with assay buffer solution (5...
US Patent US10150728 (2018)
BindingDB Entry DOI: 10.7270/Q2WD42M7