BDBM307543 5-(3-((2-Cyanopropan-2-yl)carbamoyl)phenyl)-2-(4-fluorophenyl)-N-methyl-6-(2,2,2-trifluoroethoxy)benzofuran-3-carboxamide::US10150747, Example 10
SMILES: CNC(=O)c1c(oc2cc(OCC(F)(F)F)c(cc12)-c1cccc(c1)C(=O)NC(C)(C)C#N)-c1ccc(F)cc1
InChI Key: InChIKey=FUZFHVFOVWBTDV-UHFFFAOYSA-N
Data: 1 IC50  1 EC50
Activity Spreadsheet -- Enzyme Inhibition Constant Data from BindingDB
Found 2 hits for monomerid = 307543
Trg + Lig
Ki
nM
ΔG°
kcal/mole
IC50
nM
Kd
nM
EC50/IC50
nM
koff
s-1
kon
M-1s-1
pHTemp
°C
RNA polymerase (NS5B)
(Hepatitis C virus (HCV))
BDBM307543
(5-(3-((2-Cyanopropan-2-yl)carbamoyl)phenyl)-2-(4-f...)
Show SMILES CNC(=O)c1c(oc2cc(OCC(F)(F)F)c(cc12)-c1cccc(c1)C(=O)NC(C)(C)C#N)-c1ccc(F)cc1
Show InChI InChI=1S/C29H23F4N3O4/c1-28(2,14-34)36-26(37)18-6-4-5-17(11-18)20-12-21-23(13-22(20)39-15-29(31,32)33)40-25(24(21)27(38)35-3)16-7-9-19(30)10-8-16/h4-13H,15H2,1-3H3,(H,35,38)(H,36,37)
US Patent
n/an/an/an/a 5.01n/an/an/an/a
Bristol-Myers Squibb Company
US Patent
Assay Description
To evaluate compound efficacy, titrated compounds were transferred to sterile 384-well tissue culture treated plates, and the plates were seeded with...
US Patent US10150747 (2018)
BindingDB Entry DOI: 10.7270/Q2H70HWJ
RNA polymerase (NS5B)
(Hepatitis C virus (HCV))
BDBM307543
(5-(3-((2-Cyanopropan-2-yl)carbamoyl)phenyl)-2-(4-f...)
Show SMILES CNC(=O)c1c(oc2cc(OCC(F)(F)F)c(cc12)-c1cccc(c1)C(=O)NC(C)(C)C#N)-c1ccc(F)cc1
Show InChI InChI=1S/C29H23F4N3O4/c1-28(2,14-34)36-26(37)18-6-4-5-17(11-18)20-12-21-23(13-22(20)39-15-29(31,32)33)40-25(24(21)27(38)35-3)16-7-9-19(30)10-8-16/h4-13H,15H2,1-3H3,(H,35,38)(H,36,37)
US Patent
n/an/a 3.02n/an/an/an/an/an/a
Bristol-Myers Squibb Company
US Patent
Assay Description
To evaluate compound efficacy, titrated compounds were transferred to sterile 384-well tissue culture treated plates, and the plates were seeded with...
US Patent US10150747 (2018)
BindingDB Entry DOI: 10.7270/Q2H70HWJ