BDBM307545 6-Ethoxy-2-(4-fluorophenyl)-5-(4-methoxy-3-((1-(pyrimidin-2-yl)cyclo propyl)carbamoyl)phenyl)-N-methylbenzofuran-3-carboxamide::US10150747, Example 12
SMILES: CCOc1cc2oc(c(C(=O)NC)c2cc1-c1ccc(OC)c(c1)C(=O)NC1(CC1)c1ncccn1)-c1ccc(F)cc1
InChI Key: InChIKey=FLOMKMDGKRCUHN-UHFFFAOYSA-N
Data: 1 IC50  1 EC50
Activity Spreadsheet -- Enzyme Inhibition Constant Data from BindingDB
Found 2 hits for monomerid = 307545
Trg + Lig
Ki
nM
ΔG°
kcal/mole
IC50
nM
Kd
nM
EC50/IC50
nM
koff
s-1
kon
M-1s-1
pHTemp
°C
RNA polymerase (NS5B)
(Hepatitis C virus (HCV))
BDBM307545
(6-Ethoxy-2-(4-fluorophenyl)-5-(4-methoxy-3-((1-(py...)
Show SMILES CCOc1cc2oc(c(C(=O)NC)c2cc1-c1ccc(OC)c(c1)C(=O)NC1(CC1)c1ncccn1)-c1ccc(F)cc1
Show InChI InChI=1S/C33H29FN4O5/c1-4-42-26-18-27-23(28(31(40)35-2)29(43-27)19-6-9-21(34)10-7-19)17-22(26)20-8-11-25(41-3)24(16-20)30(39)38-33(12-13-33)32-36-14-5-15-37-32/h5-11,14-18H,4,12-13H2,1-3H3,(H,35,40)(H,38,39)
US Patent
n/an/an/an/a 4.20n/an/an/an/a
Bristol-Myers Squibb Company
US Patent
Assay Description
To evaluate compound efficacy, titrated compounds were transferred to sterile 384-well tissue culture treated plates, and the plates were seeded with...
US Patent US10150747 (2018)
BindingDB Entry DOI: 10.7270/Q2H70HWJ
RNA polymerase (NS5B)
(Hepatitis C virus (HCV))
BDBM307545
(6-Ethoxy-2-(4-fluorophenyl)-5-(4-methoxy-3-((1-(py...)
Show SMILES CCOc1cc2oc(c(C(=O)NC)c2cc1-c1ccc(OC)c(c1)C(=O)NC1(CC1)c1ncccn1)-c1ccc(F)cc1
Show InChI InChI=1S/C33H29FN4O5/c1-4-42-26-18-27-23(28(31(40)35-2)29(43-27)19-6-9-21(34)10-7-19)17-22(26)20-8-11-25(41-3)24(16-20)30(39)38-33(12-13-33)32-36-14-5-15-37-32/h5-11,14-18H,4,12-13H2,1-3H3,(H,35,40)(H,38,39)
US Patent
n/an/a 1.89n/an/an/an/an/an/a
Bristol-Myers Squibb Company
US Patent
Assay Description
To evaluate compound efficacy, titrated compounds were transferred to sterile 384-well tissue culture treated plates, and the plates were seeded with...
US Patent US10150747 (2018)
BindingDB Entry DOI: 10.7270/Q2H70HWJ