null
SMILES: Cn1ccc(n1)-c1ccc2C(=O)N(Cc2c1)c1cccc(n1)-c1nncn1C1CC1
InChI Key: InChIKey=CZXXWDZQGDSJQU-UHFFFAOYSA-N
Activity Spreadsheet -- Enzyme Inhibition Constant Data from BindingDB
Found 2 hits for monomerid = 307635
Trg + Lig
Ki
nM
ΔG°
kcal/mole
IC50
nM
Kd
nM
EC50/IC50
nM
koff
s-1
kon
M-1s-1
pHTemp
°C
Mitogen-activated protein kinase kinase kinase 5
(Homo sapiens (Human))
BDBM307635
(6-chloro-2-(6-(4-cyclopropyl-4H-1,2,4-triazol-3-yl...)
Show SMILES Cn1ccc(n1)-c1ccc2C(=O)N(Cc2c1)c1cccc(n1)-c1nncn1C1CC1
Show InChI InChI=1S/C22H19N7O/c1-27-10-9-18(26-27)14-5-8-17-15(11-14)12-28(22(17)30)20-4-2-3-19(24-20)21-25-23-13-29(21)16-6-7-16/h2-5,8-11,13,16H,6-7,12H2,1H3
US Patent
<200n/an/an/an/an/an/an/an/a
SEAL ROCK THERAPEUTICS, INC.
US Patent
Assay Description
The ASK1 enzymatic assay was run following Promega ASK1 Kinase Enzyme System (Cat #V3881). The kit provides the protocol, enzymes and all reagents ne...
US Patent US10150755 (2018)
BindingDB Entry DOI: 10.7270/Q2125VQ8
Mitogen-activated protein kinase kinase kinase 5
(Homo sapiens (Human))
BDBM307635
(6-chloro-2-(6-(4-cyclopropyl-4H-1,2,4-triazol-3-yl...)
Show SMILES Cn1ccc(n1)-c1ccc2C(=O)N(Cc2c1)c1cccc(n1)-c1nncn1C1CC1
Show InChI InChI=1S/C22H19N7O/c1-27-10-9-18(26-27)14-5-8-17-15(11-14)12-28(22(17)30)20-4-2-3-19(24-20)21-25-23-13-29(21)16-6-7-16/h2-5,8-11,13,16H,6-7,12H2,1H3
US Patent
n/an/a<200n/an/an/an/an/an/a
SEAL ROCK THERAPEUTICS, INC.
US Patent
Assay Description
The ASK1 enzymatic assay was run following Promega ASK1 Kinase Enzyme System (Cat #V3881). The kit provides the protocol, enzymes and all reagents ne...
US Patent US10150755 (2018)
BindingDB Entry DOI: 10.7270/Q27P91GS