BDBM307643 2-(6-(4-cyclopropyl-4H-1,2,4-triazol-3-yl)pyridin-2-yl)-5-(ethylamino)isoindolin-1-one ::US10150755, Compound 35
SMILES: CCNc1ccc2C(=O)N(Cc2c1)c1cccc(n1)-c1nncn1C1CC1
InChI Key: InChIKey=GDKMFUAQNSAQQU-UHFFFAOYSA-N
Data: 1 KI  1 IC50
Activity Spreadsheet -- Enzyme Inhibition Constant Data from BindingDB
Found 2 hits for monomerid = 307643
Trg + Lig
Ki
nM
ΔG°
kcal/mole
IC50
nM
Kd
nM
EC50/IC50
nM
koff
s-1
kon
M-1s-1
pHTemp
°C
Mitogen-activated protein kinase kinase kinase 5
(Homo sapiens (Human))
BDBM307643
(2-(6-(4-cyclopropyl-4H-1,2,4-triazol-3-yl)pyridin-...)
Show SMILES CCNc1ccc2C(=O)N(Cc2c1)c1cccc(n1)-c1nncn1C1CC1
Show InChI InChI=1S/C20H20N6O/c1-2-21-14-6-9-16-13(10-14)11-25(20(16)27)18-5-3-4-17(23-18)19-24-22-12-26(19)15-7-8-15/h3-6,9-10,12,15,21H,2,7-8,11H2,1H3
US Patent
<200n/an/an/an/an/an/an/an/a
SEAL ROCK THERAPEUTICS, INC.
US Patent
Assay Description
The ASK1 enzymatic assay was run following Promega ASK1 Kinase Enzyme System (Cat #V3881). The kit provides the protocol, enzymes and all reagents ne...
US Patent US10150755 (2018)
BindingDB Entry DOI: 10.7270/Q2125VQ8
Mitogen-activated protein kinase kinase kinase 5
(Homo sapiens (Human))
BDBM307643
(2-(6-(4-cyclopropyl-4H-1,2,4-triazol-3-yl)pyridin-...)
Show SMILES CCNc1ccc2C(=O)N(Cc2c1)c1cccc(n1)-c1nncn1C1CC1
Show InChI InChI=1S/C20H20N6O/c1-2-21-14-6-9-16-13(10-14)11-25(20(16)27)18-5-3-4-17(23-18)19-24-22-12-26(19)15-7-8-15/h3-6,9-10,12,15,21H,2,7-8,11H2,1H3
US Patent
n/an/a<200n/an/an/an/an/an/a
SEAL ROCK THERAPEUTICS, INC.
US Patent
Assay Description
The ASK1 enzymatic assay was run following Promega ASK1 Kinase Enzyme System (Cat #V3881). The kit provides the protocol, enzymes and all reagents ne...
US Patent US10150755 (2018)
BindingDB Entry DOI: 10.7270/Q27P91GS