null
SMILES: CC(C)Cn1c(N)c(C(=O)NCc2cccs2)c2nc3ccccc3nc12
InChI Key: InChIKey=QMIQLZBURIQOHA-UHFFFAOYSA-N
Activity Spreadsheet -- Enzyme Inhibition Constant Data from BindingDB
Found 4 hits for monomerid = 30765
Trg + Lig
Ki
nM
ΔG°
kcal/mole
IC50
nM
Kd
nM
EC50/IC50
nM
koff
s-1
kon
M-1s-1
pHTemp
°C
5-hydroxytryptamine receptor 1A
(Homo sapiens (Human))
BDBM30765
(2-amino-1-(2-methylpropyl)-N-(thiophen-2-ylmethyl)...)
Show SMILES CC(C)Cn1c(N)c(C(=O)NCc2cccs2)c2nc3ccccc3nc12
Show InChI InChI=1S/C20H21N5OS/c1-12(2)11-25-18(21)16(20(26)22-10-13-6-5-9-27-13)17-19(25)24-15-8-4-3-7-14(15)23-17/h3-9,12H,10-11,21H2,1-2H3,(H,22,26)
PCBioAssay
n/an/an/an/a 3.66E+3n/an/a7.423
The Scripps Research Institute Molecular Screening Center
Curated by PubChem BioAssay
Assay Description
A cell line containing the human 5-HT1a receptor, the promiscuous G-alpha-15 protein (Ga15) as well as the beta-lactamase (BLA) reporter-gene under c...
PubChem Bioassay (2007)
BindingDB Entry DOI: 10.7270/Q21N7ZG0
Streptokinase A
(Streptococcus pyogenes M1 GAS)
BDBM30765
(2-amino-1-(2-methylpropyl)-N-(thiophen-2-ylmethyl)...)
Show SMILES CC(C)Cn1c(N)c(C(=O)NCc2cccs2)c2nc3ccccc3nc12
Show InChI InChI=1S/C20H21N5OS/c1-12(2)11-25-18(21)16(20(26)22-10-13-6-5-9-27-13)17-19(25)24-15-8-4-3-7-14(15)23-17/h3-9,12H,10-11,21H2,1-2H3,(H,22,26)
PCBioAssay
n/an/an/an/a 3.02E+4n/an/an/an/a
Broad Institute
Curated by PubChem BioAssay
Assay Description
Keywords: Group A streptococcus, GAS, streptokinase, expression, virulence, inhibition, dose response, EC50 Assay Overview: The goal of this assa...
PubChem Bioassay (2009)
BindingDB Entry DOI: 10.7270/Q2736PBV
Lysosomal acid glucosylceramidase
(Homo sapiens (Human))
BDBM30765
(2-amino-1-(2-methylpropyl)-N-(thiophen-2-ylmethyl)...)
Show SMILES CC(C)Cn1c(N)c(C(=O)NCc2cccs2)c2nc3ccccc3nc12
Show InChI InChI=1S/C20H21N5OS/c1-12(2)11-25-18(21)16(20(26)22-10-13-6-5-9-27-13)17-19(25)24-15-8-4-3-7-14(15)23-17/h3-9,12H,10-11,21H2,1-2H3,(H,22,26)
Reactome pathway
PCBioAssay
n/an/an/an/a 2.49E+3n/an/an/an/a
The Scripps Research Institute Molecular Screening Center
Curated by PubChem BioAssay
Assay Description
Source (MLSCN Center Name): The Scripps Research Institute Molecular Screening Center Center Affiliation: The Scripps Research Institute, TSRI Assay ...
PubChem Bioassay (2008)
BindingDB Entry DOI: 10.7270/Q23J3BC8
Sphingosine 1-phosphate receptor 3
(Homo sapiens (Human))
BDBM30765
(2-amino-1-(2-methylpropyl)-N-(thiophen-2-ylmethyl)...)
Show SMILES CC(C)Cn1c(N)c(C(=O)NCc2cccs2)c2nc3ccccc3nc12
Show InChI InChI=1S/C20H21N5OS/c1-12(2)11-25-18(21)16(20(26)22-10-13-6-5-9-27-13)17-19(25)24-15-8-4-3-7-14(15)23-17/h3-9,12H,10-11,21H2,1-2H3,(H,22,26)
NCI pathway
Reactome pathway
PCBioAssay
n/an/an/an/a 2.97E+4n/an/an/an/a
The Scripps Research Institute Molecular Screening Center
Curated by PubChem BioAssay
Assay Description
Source (MLSCN Center Name): The Scripps Research Institute Molecular Screening Center Center Affiliation: The Scripps Research Institute, TSRI Networ...
PubChem Bioassay (2007)
BindingDB Entry DOI: 10.7270/Q2PZ576Z