null
SMILES: Cc1ccc(cn1)-c1ccc2CN(C(=O)c2c1)c1cccc(n1)-c1nncn1C1CC1
InChI Key: InChIKey=UAGHSQBOKUDAIM-UHFFFAOYSA-N
Activity Spreadsheet -- Enzyme Inhibition Constant Data from BindingDB
Found 2 hits for monomerid = 307650
Trg + Lig
Ki
nM
ΔG°
kcal/mole
IC50
nM
Kd
nM
EC50/IC50
nM
koff
s-1
kon
M-1s-1
pHTemp
°C
Mitogen-activated protein kinase kinase kinase 5
(Homo sapiens (Human))
BDBM307650
(2-(6-(4-cyclopropyl- 4H-1,2,4-triazol-3- yl)pyridi...)
Show SMILES Cc1ccc(cn1)-c1ccc2CN(C(=O)c2c1)c1cccc(n1)-c1nncn1C1CC1
Show InChI InChI=1S/C24H20N6O/c1-15-5-6-17(12-25-15)16-7-8-18-13-29(24(31)20(18)11-16)22-4-2-3-21(27-22)23-28-26-14-30(23)19-9-10-19/h2-8,11-12,14,19H,9-10,13H2,1H3
US Patent
<200n/an/an/an/an/an/an/an/a
SEAL ROCK THERAPEUTICS, INC.
US Patent
Assay Description
The ASK1 enzymatic assay was run following Promega ASK1 Kinase Enzyme System (Cat #V3881). The kit provides the protocol, enzymes and all reagents ne...
US Patent US10150755 (2018)
BindingDB Entry DOI: 10.7270/Q2125VQ8
Mitogen-activated protein kinase kinase kinase 5
(Homo sapiens (Human))
BDBM307650
(2-(6-(4-cyclopropyl- 4H-1,2,4-triazol-3- yl)pyridi...)
Show SMILES Cc1ccc(cn1)-c1ccc2CN(C(=O)c2c1)c1cccc(n1)-c1nncn1C1CC1
Show InChI InChI=1S/C24H20N6O/c1-15-5-6-17(12-25-15)16-7-8-18-13-29(24(31)20(18)11-16)22-4-2-3-21(27-22)23-28-26-14-30(23)19-9-10-19/h2-8,11-12,14,19H,9-10,13H2,1H3
US Patent
n/an/a<200n/an/an/an/an/an/a
SEAL ROCK THERAPEUTICS, INC.
US Patent
Assay Description
The ASK1 enzymatic assay was run following Promega ASK1 Kinase Enzyme System (Cat #V3881). The kit provides the protocol, enzymes and all reagents ne...
US Patent US10150755 (2018)
BindingDB Entry DOI: 10.7270/Q27P91GS