null
SMILES: Fc1ccncc1-c1ccc2CN(C(=O)c2c1)c1cccc(n1)-c1nncn1C1CC1
InChI Key: InChIKey=AWSZRJQXHUFOCZ-UHFFFAOYSA-N
Activity Spreadsheet -- Enzyme Inhibition Constant Data from BindingDB
Found 2 hits for monomerid = 307656
Trg + Lig
Ki
nM
ΔG°
kcal/mole
IC50
nM
Kd
nM
EC50/IC50
nM
koff
s-1
kon
M-1s-1
pHTemp
°C
Mitogen-activated protein kinase kinase kinase 5
(Homo sapiens (Human))
BDBM307656
(2-(6-(4-cyclopropyl- 4H-1,2,4-triazol-3- yl)pyridi...)
Show SMILES Fc1ccncc1-c1ccc2CN(C(=O)c2c1)c1cccc(n1)-c1nncn1C1CC1
Show InChI InChI=1S/C23H17FN6O/c24-19-8-9-25-11-18(19)14-4-5-15-12-29(23(31)17(15)10-14)21-3-1-2-20(27-21)22-28-26-13-30(22)16-6-7-16/h1-5,8-11,13,16H,6-7,12H2
US Patent
<200n/an/an/an/an/an/an/an/a
SEAL ROCK THERAPEUTICS, INC.
US Patent
Assay Description
The ASK1 enzymatic assay was run following Promega ASK1 Kinase Enzyme System (Cat #V3881). The kit provides the protocol, enzymes and all reagents ne...
US Patent US10150755 (2018)
BindingDB Entry DOI: 10.7270/Q2125VQ8
Mitogen-activated protein kinase kinase kinase 5
(Homo sapiens (Human))
BDBM307656
(2-(6-(4-cyclopropyl- 4H-1,2,4-triazol-3- yl)pyridi...)
Show SMILES Fc1ccncc1-c1ccc2CN(C(=O)c2c1)c1cccc(n1)-c1nncn1C1CC1
Show InChI InChI=1S/C23H17FN6O/c24-19-8-9-25-11-18(19)14-4-5-15-12-29(23(31)17(15)10-14)21-3-1-2-20(27-21)22-28-26-13-30(22)16-6-7-16/h1-5,8-11,13,16H,6-7,12H2
US Patent
n/an/a<200n/an/an/an/an/an/a
SEAL ROCK THERAPEUTICS, INC.
US Patent
Assay Description
The ASK1 enzymatic assay was run following Promega ASK1 Kinase Enzyme System (Cat #V3881). The kit provides the protocol, enzymes and all reagents ne...
US Patent US10150755 (2018)
BindingDB Entry DOI: 10.7270/Q27P91GS