BDBM307664 2-(6-(4-cyclopropyl-4H-1,2,4-triazol-3-yl)pyridin-2-yl)-6-(2-cyclopropylpyrimidin-5-yl)isoindolin-1-one ::US10150755, Compound 56
SMILES: O=C1N(Cc2ccc(cc12)-c1cnc(nc1)C1CC1)c1cccc(n1)-c1nncn1C1CC1
InChI Key: InChIKey=DODPWPIQCPQNBS-UHFFFAOYSA-N
Data: 1 KI  1 IC50
Activity Spreadsheet -- Enzyme Inhibition Constant Data from BindingDB
Found 2 hits for monomerid = 307664
Trg + Lig
Ki
nM
ΔG°
kcal/mole
IC50
nM
Kd
nM
EC50/IC50
nM
koff
s-1
kon
M-1s-1
pHTemp
°C
Mitogen-activated protein kinase kinase kinase 5
(Homo sapiens (Human))
BDBM307664
(2-(6-(4-cyclopropyl-4H-1,2,4-triazol-3-yl)pyridin-...)
Show SMILES O=C1N(Cc2ccc(cc12)-c1cnc(nc1)C1CC1)c1cccc(n1)-c1nncn1C1CC1
Show InChI InChI=1S/C25H21N7O/c33-25-20-10-16(18-11-26-23(27-12-18)15-4-5-15)6-7-17(20)13-31(25)22-3-1-2-21(29-22)24-30-28-14-32(24)19-8-9-19/h1-3,6-7,10-12,14-15,19H,4-5,8-9,13H2
US Patent
<200n/an/an/an/an/an/an/an/a
SEAL ROCK THERAPEUTICS, INC.
US Patent
Assay Description
The ASK1 enzymatic assay was run following Promega ASK1 Kinase Enzyme System (Cat #V3881). The kit provides the protocol, enzymes and all reagents ne...
US Patent US10150755 (2018)
BindingDB Entry DOI: 10.7270/Q2125VQ8
Mitogen-activated protein kinase kinase kinase 5
(Homo sapiens (Human))
BDBM307664
(2-(6-(4-cyclopropyl-4H-1,2,4-triazol-3-yl)pyridin-...)
Show SMILES O=C1N(Cc2ccc(cc12)-c1cnc(nc1)C1CC1)c1cccc(n1)-c1nncn1C1CC1
Show InChI InChI=1S/C25H21N7O/c33-25-20-10-16(18-11-26-23(27-12-18)15-4-5-15)6-7-17(20)13-31(25)22-3-1-2-21(29-22)24-30-28-14-32(24)19-8-9-19/h1-3,6-7,10-12,14-15,19H,4-5,8-9,13H2
US Patent
n/an/a<200n/an/an/an/an/an/a
SEAL ROCK THERAPEUTICS, INC.
US Patent
Assay Description
The ASK1 enzymatic assay was run following Promega ASK1 Kinase Enzyme System (Cat #V3881). The kit provides the protocol, enzymes and all reagents ne...
US Patent US10150755 (2018)
BindingDB Entry DOI: 10.7270/Q27P91GS