BDBM307690 US10150755, Compound 82
SMILES:
InChI Key: InChIKey=JHXGRCVWBSONFR-GFCCVEGCSA-N
Data: 1 KI  1 IC50
Activity Spreadsheet -- Enzyme Inhibition Constant Data from BindingDB
Found 2 hits for monomerid = 307690
Trg + Lig
Ki
nM
ΔG°
kcal/mole
IC50
nM
Kd
nM
EC50/IC50
nM
koff
s-1
kon
M-1s-1
pHTemp
°C
Mitogen-activated protein kinase kinase kinase 5
(Homo sapiens (Human))
BDBM307690
(US10150755, Compound 82)
Show InChI InChI=1S/C19H17N5O/c1-12-9-10-17-21-22-18(24(12)17)15-7-4-8-16(20-15)23-11-13-5-2-3-6-14(13)19(23)25/h2-8,12H,9-11H2,1H3/t12-/m1/s1
US Patent
<200n/an/an/an/an/an/an/an/a
SEAL ROCK THERAPEUTICS, INC.
US Patent
Assay Description
The ASK1 enzymatic assay was run following Promega ASK1 Kinase Enzyme System (Cat #V3881). The kit provides the protocol, enzymes and all reagents ne...
US Patent US10150755 (2018)
BindingDB Entry DOI: 10.7270/Q2125VQ8
Mitogen-activated protein kinase kinase kinase 5
(Homo sapiens (Human))
BDBM307690
(US10150755, Compound 82)
Show InChI InChI=1S/C19H17N5O/c1-12-9-10-17-21-22-18(24(12)17)15-7-4-8-16(20-15)23-11-13-5-2-3-6-14(13)19(23)25/h2-8,12H,9-11H2,1H3/t12-/m1/s1
US Patent
n/an/a<200n/an/an/an/an/an/a
SEAL ROCK THERAPEUTICS, INC.
US Patent
Assay Description
The ASK1 enzymatic assay was run following Promega ASK1 Kinase Enzyme System (Cat #V3881). The kit provides the protocol, enzymes and all reagents ne...
US Patent US10150755 (2018)
BindingDB Entry DOI: 10.7270/Q27P91GS