BDBM308060 US10011593, Ex. 11::US9650366, 11
SMILES: Nc1ncc(cc1C#Cc1cccc(NC(=O)Nc2ccc(Cl)c(c2)C(F)(F)F)c1)-c1nnn(CCCO)n1
InChI Key: InChIKey=AOCNJYRBRZNBTL-UHFFFAOYSA-N
Data: 1 KI  1 IC50
Activity Spreadsheet -- Enzyme Inhibition Constant Data from BindingDB
Found 2 hits for monomerid = 308060
Trg + Lig
Ki
nM
ΔG°
kcal/mole
IC50
nM
Kd
nM
EC50/IC50
nM
koff
s-1
kon
M-1s-1
pHTemp
°C
Interferon-induced, double-stranded RNA-activated protein kinase
(Homo sapiens (Human))
BDBM308060
(US10011593, Ex. 11 | US9650366, 11)
Show SMILES Nc1ncc(cc1C#Cc1cccc(NC(=O)Nc2ccc(Cl)c(c2)C(F)(F)F)c1)-c1nnn(CCCO)n1
Show InChI InChI=1S/C25H20ClF3N8O2/c26-21-8-7-19(13-20(21)25(27,28)29)33-24(39)32-18-4-1-3-15(11-18)5-6-16-12-17(14-31-22(16)30)23-34-36-37(35-23)9-2-10-38/h1,3-4,7-8,11-14,38H,2,9-10H2,(H2,30,31)(H2,32,33,39)
NCI pathway
Reactome pathway
US Patent
158n/an/an/an/an/an/an/an/a
ALLERGAN, INC.
US Patent
Assay Description
Biochemical PDGFRβ kinase assays were performed in 96 well microtiter plates that were coated overnight with 75 μg of poly-Glu-Tyr (4:1) in...
US Patent US9650366 (2017)
BindingDB Entry DOI: 10.7270/Q2QN68VG
Interferon-induced, double-stranded RNA-activated protein kinase
(Homo sapiens (Human))
BDBM308060
(US10011593, Ex. 11 | US9650366, 11)
Show SMILES Nc1ncc(cc1C#Cc1cccc(NC(=O)Nc2ccc(Cl)c(c2)C(F)(F)F)c1)-c1nnn(CCCO)n1
Show InChI InChI=1S/C25H20ClF3N8O2/c26-21-8-7-19(13-20(21)25(27,28)29)33-24(39)32-18-4-1-3-15(11-18)5-6-16-12-17(14-31-22(16)30)23-34-36-37(35-23)9-2-10-38/h1,3-4,7-8,11-14,38H,2,9-10H2,(H2,30,31)(H2,32,33,39)
NCI pathway
Reactome pathway
US Patent
n/an/a 158n/an/an/an/an/an/a
Vertex
Assay Description
PKR: Commercially available recombinant human GST-PKR (SignalChem, Canada; 1.5 uM-2 uM stock) is diluted to 500 nM in assay buffer (20 mM Tris-HCl, p...
J Med Chem 52: 6362-8 (2009)
BindingDB Entry DOI: 10.7270/Q24J0HGV