BDBM308275 US9649309, Compound UNC3118A
SMILES: CCCCNc1ncc(c(N[C@H]2CC[C@H](O)CC2)n1)-c1ccnc(N)n1
InChI Key: InChIKey=AAUNIEBMIUGNTA-JOCQHMNTSA-N
Data: 5 IC50
Activity Spreadsheet -- Enzyme Inhibition Constant Data from BindingDB
Found 5 hits for monomerid = 308275
Trg + Lig
Ki
nM
ΔG°
kcal/mole
IC50
nM
Kd
nM
EC50/IC50
nM
koff
s-1
kon
M-1s-1
pHTemp
°C
Tyrosine-protein kinase Mer
(Homo sapiens (Human))
BDBM308275
(US9649309, Compound UNC3118A)
Show SMILES CCCCNc1ncc(c(N[C@H]2CC[C@H](O)CC2)n1)-c1ccnc(N)n1 |r,wU:11.10,wD:14.14,(-6.67,-3.85,;-5.33,-3.08,;-4,-3.85,;-2.67,-3.08,;-1.33,-3.85,;,-3.08,;1.33,-3.85,;2.67,-3.08,;2.67,-1.54,;1.33,-.77,;1.33,.77,;,1.54,;-1.33,.77,;-2.67,1.54,;-2.67,3.08,;-4,3.85,;-1.33,3.85,;,3.08,;,-1.54,;4,-.77,;5.33,-1.54,;6.67,-.77,;6.67,.77,;5.33,1.54,;5.33,3.08,;4,.77,)|
Show InChI InChI=1S/C18H27N7O/c1-2-3-9-21-18-22-11-14(15-8-10-20-17(19)24-15)16(25-18)23-12-4-6-13(26)7-5-12/h8,10-13,26H,2-7,9H2,1H3,(H2,19,20,24)(H2,21,22,23,25)/t12-,13-
Reactome pathway
US Patent
n/an/a 1.10n/an/an/an/an/an/a
The University of North Carolina at Chapel Hill
US Patent
Assay Description
Briefly, activity assays were performed in a 384 well, polypropylene microplate in a final volume of 50 μL of 50 mM Hepes, Ph 7.4 containing 10 ...
US Patent US9649309 (2017)
BindingDB Entry DOI: 10.7270/Q26Q209H
Growth arrest-specific protein 6
(Homo sapiens (Human))
BDBM308275
(US9649309, Compound UNC3118A)
Show SMILES CCCCNc1ncc(c(N[C@H]2CC[C@H](O)CC2)n1)-c1ccnc(N)n1 |r,wU:11.10,wD:14.14,(-6.67,-3.85,;-5.33,-3.08,;-4,-3.85,;-2.67,-3.08,;-1.33,-3.85,;,-3.08,;1.33,-3.85,;2.67,-3.08,;2.67,-1.54,;1.33,-.77,;1.33,.77,;,1.54,;-1.33,.77,;-2.67,1.54,;-2.67,3.08,;-4,3.85,;-1.33,3.85,;,3.08,;,-1.54,;4,-.77,;5.33,-1.54,;6.67,-.77,;6.67,.77,;5.33,1.54,;5.33,3.08,;4,.77,)|
Show InChI InChI=1S/C18H27N7O/c1-2-3-9-21-18-22-11-14(15-8-10-20-17(19)24-15)16(25-18)23-12-4-6-13(26)7-5-12/h8,10-13,26H,2-7,9H2,1H3,(H2,19,20,24)(H2,21,22,23,25)/t12-,13-
US Patent
n/an/a 23n/an/an/an/an/an/a
The University of North Carolina at Chapel Hill
US Patent
Assay Description
Briefly, activity assays were performed in a 384 well, polypropylene microplate in a final volume of 50 μL of 50 mM Hepes, Ph 7.4 containing 10 ...
US Patent US9649309 (2017)
BindingDB Entry DOI: 10.7270/Q26Q209H
Tyrosine-protein kinase Mer
(Homo sapiens (Human))
BDBM308275
(US9649309, Compound UNC3118A)
Show SMILES CCCCNc1ncc(c(N[C@H]2CC[C@H](O)CC2)n1)-c1ccnc(N)n1 |r,wU:11.10,wD:14.14,(-6.67,-3.85,;-5.33,-3.08,;-4,-3.85,;-2.67,-3.08,;-1.33,-3.85,;,-3.08,;1.33,-3.85,;2.67,-3.08,;2.67,-1.54,;1.33,-.77,;1.33,.77,;,1.54,;-1.33,.77,;-2.67,1.54,;-2.67,3.08,;-4,3.85,;-1.33,3.85,;,3.08,;,-1.54,;4,-.77,;5.33,-1.54,;6.67,-.77,;6.67,.77,;5.33,1.54,;5.33,3.08,;4,.77,)|
Show InChI InChI=1S/C18H27N7O/c1-2-3-9-21-18-22-11-14(15-8-10-20-17(19)24-15)16(25-18)23-12-4-6-13(26)7-5-12/h8,10-13,26H,2-7,9H2,1H3,(H2,19,20,24)(H2,21,22,23,25)/t12-,13-
Reactome pathway
US Patent
n/an/a<10n/an/an/an/an/an/a
The University of North Carolina at Chapel Hill
US Patent
Assay Description
Briefly, activity assays were performed in a 384 well, polypropylene microplate in a final volume of 50 μL of 50 mM Hepes, Ph 7.4 containing 10 ...
US Patent US9649309 (2017)
BindingDB Entry DOI: 10.7270/Q26Q209H
Tyrosine-protein kinase receptor TYRO3
(Homo sapiens (Human))
BDBM308275
(US9649309, Compound UNC3118A)
Show SMILES CCCCNc1ncc(c(N[C@H]2CC[C@H](O)CC2)n1)-c1ccnc(N)n1 |r,wU:11.10,wD:14.14,(-6.67,-3.85,;-5.33,-3.08,;-4,-3.85,;-2.67,-3.08,;-1.33,-3.85,;,-3.08,;1.33,-3.85,;2.67,-3.08,;2.67,-1.54,;1.33,-.77,;1.33,.77,;,1.54,;-1.33,.77,;-2.67,1.54,;-2.67,3.08,;-4,3.85,;-1.33,3.85,;,3.08,;,-1.54,;4,-.77,;5.33,-1.54,;6.67,-.77,;6.67,.77,;5.33,1.54,;5.33,3.08,;4,.77,)|
Show InChI InChI=1S/C18H27N7O/c1-2-3-9-21-18-22-11-14(15-8-10-20-17(19)24-15)16(25-18)23-12-4-6-13(26)7-5-12/h8,10-13,26H,2-7,9H2,1H3,(H2,19,20,24)(H2,21,22,23,25)/t12-,13-
US Patent
n/an/a 113n/an/an/an/an/an/a
The University of North Carolina at Chapel Hill
US Patent
Assay Description
Briefly, activity assays were performed in a 384 well, polypropylene microplate in a final volume of 50 μL of 50 mM Hepes, Ph 7.4 containing 10 ...
US Patent US9649309 (2017)
BindingDB Entry DOI: 10.7270/Q26Q209H
Receptor-type tyrosine-protein kinase FLT3
(Homo sapiens (Human))
BDBM308275
(US9649309, Compound UNC3118A)
Show SMILES CCCCNc1ncc(c(N[C@H]2CC[C@H](O)CC2)n1)-c1ccnc(N)n1 |r,wU:11.10,wD:14.14,(-6.67,-3.85,;-5.33,-3.08,;-4,-3.85,;-2.67,-3.08,;-1.33,-3.85,;,-3.08,;1.33,-3.85,;2.67,-3.08,;2.67,-1.54,;1.33,-.77,;1.33,.77,;,1.54,;-1.33,.77,;-2.67,1.54,;-2.67,3.08,;-4,3.85,;-1.33,3.85,;,3.08,;,-1.54,;4,-.77,;5.33,-1.54,;6.67,-.77,;6.67,.77,;5.33,1.54,;5.33,3.08,;4,.77,)|
Show InChI InChI=1S/C18H27N7O/c1-2-3-9-21-18-22-11-14(15-8-10-20-17(19)24-15)16(25-18)23-12-4-6-13(26)7-5-12/h8,10-13,26H,2-7,9H2,1H3,(H2,19,20,24)(H2,21,22,23,25)/t12-,13-
US Patent
n/an/a 2.70n/an/an/an/an/an/a
The University of North Carolina at Chapel Hill
US Patent
Assay Description
Briefly, activity assays were performed in a 384 well, polypropylene microplate in a final volume of 50 μL of 50 mM Hepes, Ph 7.4 containing 10 ...
US Patent US9649309 (2017)
BindingDB Entry DOI: 10.7270/Q26Q209H