BDBM3083 2-aminopyrido[2,3-d]pyrimidin-7(8H)-one 50::6-(2,6-dichlorophenyl)-2-[(3-hydroxyphenyl)amino]-8-methyl-7H,8H-pyrido[2,3-d]pyrimidin-7-one::PD 166285 analog
SMILES: Cn1c2nc(Nc3cccc(O)c3)ncc2cc(-c2c(Cl)cccc2Cl)c1=O
InChI Key: InChIKey=YLOVBNCIDYKIDW-UHFFFAOYSA-N
Data: 8 IC50
Activity Spreadsheet -- Enzyme Inhibition Constant Data from BindingDB
Found 8 hits for monomerid = 3083
Trg + Lig
Ki
nM
ΔG°
kcal/mole
IC50
nM
Kd
nM
EC50/IC50
nM
koff
s-1
kon
M-1s-1
pHTemp
°C
Platelet-derived growth factor receptor beta
(Homo sapiens (Human))
BDBM3083
(2-aminopyrido[2,3-d]pyrimidin-7(8H)-one 50 | 6-(2,...)
Show SMILES Cn1c2nc(Nc3cccc(O)c3)ncc2cc(-c2c(Cl)cccc2Cl)c1=O |(-2.82,-1.97,;-2.82,-.43,;-4.15,.34,;-5.48,-.43,;-6.82,.34,;-8.15,-.43,;-8.15,-1.97,;-6.82,-2.74,;-6.82,-4.28,;-8.15,-5.05,;-9.48,-4.28,;-10.82,-5.05,;-9.48,-2.74,;-6.82,1.88,;-5.48,2.65,;-4.15,1.88,;-2.82,2.65,;-1.48,1.88,;-.15,2.65,;-.15,4.19,;-1.48,4.96,;1.18,4.96,;2.52,4.19,;2.52,2.65,;1.18,1.88,;1.18,.34,;-1.48,.34,;-.15,-.43,)|
Show InChI InChI=1S/C20H14Cl2N4O2/c1-26-18-11(8-14(19(26)28)17-15(21)6-3-7-16(17)22)10-23-20(25-18)24-12-4-2-5-13(27)9-12/h2-10,27H,1H3,(H,23,24,25)
NCI pathway
Reactome pathway
n/an/a 410n/an/an/an/an/an/a
Parke-Davis Pharmaceutical Research
Assay Description
IC50 is the inhibitor concentration which inhibits 50% of kinase activity that catalyzes the transfer of the terminal phosphate from [gamma-32P] labe...
J Med Chem 41: 3276-92 (1998)
Article DOI: 10.1021/jm9802259
BindingDB Entry DOI: 10.7270/Q27P8WK3
Fibroblast growth factor receptor 1
(Homo sapiens (Human))
BDBM3083
(2-aminopyrido[2,3-d]pyrimidin-7(8H)-one 50 | 6-(2,...)
Show SMILES Cn1c2nc(Nc3cccc(O)c3)ncc2cc(-c2c(Cl)cccc2Cl)c1=O |(-2.82,-1.97,;-2.82,-.43,;-4.15,.34,;-5.48,-.43,;-6.82,.34,;-8.15,-.43,;-8.15,-1.97,;-6.82,-2.74,;-6.82,-4.28,;-8.15,-5.05,;-9.48,-4.28,;-10.82,-5.05,;-9.48,-2.74,;-6.82,1.88,;-5.48,2.65,;-4.15,1.88,;-2.82,2.65,;-1.48,1.88,;-.15,2.65,;-.15,4.19,;-1.48,4.96,;1.18,4.96,;2.52,4.19,;2.52,2.65,;1.18,1.88,;1.18,.34,;-1.48,.34,;-.15,-.43,)|
Show InChI InChI=1S/C20H14Cl2N4O2/c1-26-18-11(8-14(19(26)28)17-15(21)6-3-7-16(17)22)10-23-20(25-18)24-12-4-2-5-13(27)9-12/h2-10,27H,1H3,(H,23,24,25)
NCI pathway
Reactome pathway
n/an/a 180n/an/an/an/an/an/a
Parke-Davis Pharmaceutical Research
Assay Description
IC50 is the inhibitor concentration which inhibits 50% of kinase activity that catalyzes the transfer of the terminal phosphate from [gamma-32P] labe...
J Med Chem 41: 3276-92 (1998)
Article DOI: 10.1021/jm9802259
BindingDB Entry DOI: 10.7270/Q27P8WK3
Proto-oncogene tyrosine-protein kinase Src
(Homo sapiens (Human))
BDBM3083
(2-aminopyrido[2,3-d]pyrimidin-7(8H)-one 50 | 6-(2,...)
Show SMILES Cn1c2nc(Nc3cccc(O)c3)ncc2cc(-c2c(Cl)cccc2Cl)c1=O |(-2.82,-1.97,;-2.82,-.43,;-4.15,.34,;-5.48,-.43,;-6.82,.34,;-8.15,-.43,;-8.15,-1.97,;-6.82,-2.74,;-6.82,-4.28,;-8.15,-5.05,;-9.48,-4.28,;-10.82,-5.05,;-9.48,-2.74,;-6.82,1.88,;-5.48,2.65,;-4.15,1.88,;-2.82,2.65,;-1.48,1.88,;-.15,2.65,;-.15,4.19,;-1.48,4.96,;1.18,4.96,;2.52,4.19,;2.52,2.65,;1.18,1.88,;1.18,.34,;-1.48,.34,;-.15,-.43,)|
Show InChI InChI=1S/C20H14Cl2N4O2/c1-26-18-11(8-14(19(26)28)17-15(21)6-3-7-16(17)22)10-23-20(25-18)24-12-4-2-5-13(27)9-12/h2-10,27H,1H3,(H,23,24,25)
n/an/a 20n/an/an/an/an/an/a
Parke-Davis Pharmaceutical Research
Assay Description
IC50 is the inhibitor concentration which inhibits 50% of kinase activity that catalyzes the transfer of the terminal phosphate from [gamma-32P] labe...
J Med Chem 41: 3276-92 (1998)
Article DOI: 10.1021/jm9802259
BindingDB Entry DOI: 10.7270/Q27P8WK3
Proto-oncogene tyrosine-protein kinase Src
(Homo sapiens (Human))
BDBM3083
(2-aminopyrido[2,3-d]pyrimidin-7(8H)-one 50 | 6-(2,...)
Show SMILES Cn1c2nc(Nc3cccc(O)c3)ncc2cc(-c2c(Cl)cccc2Cl)c1=O |(-2.82,-1.97,;-2.82,-.43,;-4.15,.34,;-5.48,-.43,;-6.82,.34,;-8.15,-.43,;-8.15,-1.97,;-6.82,-2.74,;-6.82,-4.28,;-8.15,-5.05,;-9.48,-4.28,;-10.82,-5.05,;-9.48,-2.74,;-6.82,1.88,;-5.48,2.65,;-4.15,1.88,;-2.82,2.65,;-1.48,1.88,;-.15,2.65,;-.15,4.19,;-1.48,4.96,;1.18,4.96,;2.52,4.19,;2.52,2.65,;1.18,1.88,;1.18,.34,;-1.48,.34,;-.15,-.43,)|
Show InChI InChI=1S/C20H14Cl2N4O2/c1-26-18-11(8-14(19(26)28)17-15(21)6-3-7-16(17)22)10-23-20(25-18)24-12-4-2-5-13(27)9-12/h2-10,27H,1H3,(H,23,24,25)
n/an/a 43n/an/an/an/an/an/a
Memorial Sloan-Kettering Cancer Center
Curated by ChEMBL
Assay Description
Inhibition of human recombinant Src
Bioorg Med Chem Lett 19: 6872-6 (2009)
Article DOI: 10.1016/j.bmcl.2009.10.085
BindingDB Entry DOI: 10.7270/Q2R49QV4
Mitogen-activated protein kinase 14
(Homo sapiens (Human))
BDBM3083
(2-aminopyrido[2,3-d]pyrimidin-7(8H)-one 50 | 6-(2,...)
Show SMILES Cn1c2nc(Nc3cccc(O)c3)ncc2cc(-c2c(Cl)cccc2Cl)c1=O |(-2.82,-1.97,;-2.82,-.43,;-4.15,.34,;-5.48,-.43,;-6.82,.34,;-8.15,-.43,;-8.15,-1.97,;-6.82,-2.74,;-6.82,-4.28,;-8.15,-5.05,;-9.48,-4.28,;-10.82,-5.05,;-9.48,-2.74,;-6.82,1.88,;-5.48,2.65,;-4.15,1.88,;-2.82,2.65,;-1.48,1.88,;-.15,2.65,;-.15,4.19,;-1.48,4.96,;1.18,4.96,;2.52,4.19,;2.52,2.65,;1.18,1.88,;1.18,.34,;-1.48,.34,;-.15,-.43,)|
Show InChI InChI=1S/C20H14Cl2N4O2/c1-26-18-11(8-14(19(26)28)17-15(21)6-3-7-16(17)22)10-23-20(25-18)24-12-4-2-5-13(27)9-12/h2-10,27H,1H3,(H,23,24,25)
NCI pathway
Reactome pathway
n/an/a 187n/an/an/an/an/an/a
Memorial Sloan-Kettering Cancer Center
Curated by ChEMBL
Assay Description
Inhibition of human recombinant P38alpha
Bioorg Med Chem Lett 19: 6872-6 (2009)
Article DOI: 10.1016/j.bmcl.2009.10.085
BindingDB Entry DOI: 10.7270/Q2R49QV4
Tyrosine-protein kinase ABL1
(Homo sapiens (Human))
BDBM3083
(2-aminopyrido[2,3-d]pyrimidin-7(8H)-one 50 | 6-(2,...)
Show SMILES Cn1c2nc(Nc3cccc(O)c3)ncc2cc(-c2c(Cl)cccc2Cl)c1=O |(-2.82,-1.97,;-2.82,-.43,;-4.15,.34,;-5.48,-.43,;-6.82,.34,;-8.15,-.43,;-8.15,-1.97,;-6.82,-2.74,;-6.82,-4.28,;-8.15,-5.05,;-9.48,-4.28,;-10.82,-5.05,;-9.48,-2.74,;-6.82,1.88,;-5.48,2.65,;-4.15,1.88,;-2.82,2.65,;-1.48,1.88,;-.15,2.65,;-.15,4.19,;-1.48,4.96,;1.18,4.96,;2.52,4.19,;2.52,2.65,;1.18,1.88,;1.18,.34,;-1.48,.34,;-.15,-.43,)|
Show InChI InChI=1S/C20H14Cl2N4O2/c1-26-18-11(8-14(19(26)28)17-15(21)6-3-7-16(17)22)10-23-20(25-18)24-12-4-2-5-13(27)9-12/h2-10,27H,1H3,(H,23,24,25)
Reactome pathway
n/an/a 2.60n/an/an/an/an/an/a
Memorial Sloan-Kettering Cancer Center
Curated by ChEMBL
Assay Description
Inhibition of human recombinant Abl
Bioorg Med Chem Lett 19: 6872-6 (2009)
Article DOI: 10.1016/j.bmcl.2009.10.085
BindingDB Entry DOI: 10.7270/Q2R49QV4
Mast/stem cell growth factor receptor Kit
(Homo sapiens (Human))
BDBM3083
(2-aminopyrido[2,3-d]pyrimidin-7(8H)-one 50 | 6-(2,...)
Show SMILES Cn1c2nc(Nc3cccc(O)c3)ncc2cc(-c2c(Cl)cccc2Cl)c1=O |(-2.82,-1.97,;-2.82,-.43,;-4.15,.34,;-5.48,-.43,;-6.82,.34,;-8.15,-.43,;-8.15,-1.97,;-6.82,-2.74,;-6.82,-4.28,;-8.15,-5.05,;-9.48,-4.28,;-10.82,-5.05,;-9.48,-2.74,;-6.82,1.88,;-5.48,2.65,;-4.15,1.88,;-2.82,2.65,;-1.48,1.88,;-.15,2.65,;-.15,4.19,;-1.48,4.96,;1.18,4.96,;2.52,4.19,;2.52,2.65,;1.18,1.88,;1.18,.34,;-1.48,.34,;-.15,-.43,)|
Show InChI InChI=1S/C20H14Cl2N4O2/c1-26-18-11(8-14(19(26)28)17-15(21)6-3-7-16(17)22)10-23-20(25-18)24-12-4-2-5-13(27)9-12/h2-10,27H,1H3,(H,23,24,25)
n/an/a>1.00E+3n/an/an/an/an/an/a
Memorial Sloan-Kettering Cancer Center
Curated by ChEMBL
Assay Description
Inhibition of human recombinant C-Kit
Bioorg Med Chem Lett 19: 6872-6 (2009)
Article DOI: 10.1016/j.bmcl.2009.10.085
BindingDB Entry DOI: 10.7270/Q2R49QV4
Epidermal growth factor receptor
(Homo sapiens (Human))
BDBM3083
(2-aminopyrido[2,3-d]pyrimidin-7(8H)-one 50 | 6-(2,...)
Show SMILES Cn1c2nc(Nc3cccc(O)c3)ncc2cc(-c2c(Cl)cccc2Cl)c1=O |(-2.82,-1.97,;-2.82,-.43,;-4.15,.34,;-5.48,-.43,;-6.82,.34,;-8.15,-.43,;-8.15,-1.97,;-6.82,-2.74,;-6.82,-4.28,;-8.15,-5.05,;-9.48,-4.28,;-10.82,-5.05,;-9.48,-2.74,;-6.82,1.88,;-5.48,2.65,;-4.15,1.88,;-2.82,2.65,;-1.48,1.88,;-.15,2.65,;-.15,4.19,;-1.48,4.96,;1.18,4.96,;2.52,4.19,;2.52,2.65,;1.18,1.88,;1.18,.34,;-1.48,.34,;-.15,-.43,)|
Show InChI InChI=1S/C20H14Cl2N4O2/c1-26-18-11(8-14(19(26)28)17-15(21)6-3-7-16(17)22)10-23-20(25-18)24-12-4-2-5-13(27)9-12/h2-10,27H,1H3,(H,23,24,25)
n/an/a 150n/an/an/an/an/an/a
Parke-Davis Pharmaceutical Research
Assay Description
IC50 is the inhibitor concentration which inhibits 50% of kinase activity that catalyzes the transfer of the terminal phosphate from [gamma-32P] labe...
J Med Chem 41: 3276-92 (1998)
Article DOI: 10.1021/jm9802259
BindingDB Entry DOI: 10.7270/Q27P8WK3