null
SMILES: O[C@H]1CC[C@@H](CC1)Nc1nc(Nc2ccc(cc2)C(F)(F)F)ncc1-c1ccc(CN2CCCC2)cn1
InChI Key: InChIKey=WIXFZICRDRQMNT-AQYVVDRMSA-N
Activity Spreadsheet -- Enzyme Inhibition Constant Data from BindingDB
Found 4 hits for monomerid = 308336
Trg + Lig
Ki
nM
ΔG°
kcal/mole
IC50
nM
Kd
nM
EC50/IC50
nM
koff
s-1
kon
M-1s-1
pHTemp
°C
Tyrosine-protein kinase Mer
(Homo sapiens (Human))
BDBM308336
(US9649309, Compound UNC4243A)
Show SMILES O[C@H]1CC[C@@H](CC1)Nc1nc(Nc2ccc(cc2)C(F)(F)F)ncc1-c1ccc(CN2CCCC2)cn1 |r,wU:4.7,wD:1.0,(-6.52,3.85,;-5.19,3.08,;-5.19,1.54,;-3.85,.77,;-2.52,1.54,;-2.52,3.08,;-3.85,3.85,;-1.18,.77,;-1.18,-.77,;-2.52,-1.54,;-2.52,-3.08,;-3.85,-3.85,;-5.19,-3.08,;-6.52,-3.85,;-7.85,-3.08,;-7.85,-1.54,;-6.52,-.77,;-5.19,-1.54,;-9.19,-.77,;-10.52,-1.54,;-9.19,.77,;-9.19,-2.31,;-1.18,-3.85,;.15,-3.08,;.15,-1.54,;1.48,-.77,;2.82,-1.54,;4.15,-.77,;4.15,.77,;5.48,1.54,;6.82,.77,;6.82,-.77,;8.28,-1.25,;9.19,,;8.28,1.25,;2.82,1.54,;1.48,.77,)|
Show InChI InChI=1S/C27H31F3N6O/c28-27(29,30)19-4-6-21(7-5-19)34-26-32-16-23(25(35-26)33-20-8-10-22(37)11-9-20)24-12-3-18(15-31-24)17-36-13-1-2-14-36/h3-7,12,15-16,20,22,37H,1-2,8-11,13-14,17H2,(H2,32,33,34,35)/t20-,22-
Reactome pathway
US Patent
n/an/a 4.60n/an/an/an/an/an/a
The University of North Carolina at Chapel Hill
US Patent
Assay Description
Briefly, activity assays were performed in a 384 well, polypropylene microplate in a final volume of 50 μL of 50 mM Hepes, Ph 7.4 containing 10 ...
US Patent US9649309 (2017)
BindingDB Entry DOI: 10.7270/Q26Q209H
Receptor-type tyrosine-protein kinase FLT3
(Homo sapiens (Human))
BDBM308336
(US9649309, Compound UNC4243A)
Show SMILES O[C@H]1CC[C@@H](CC1)Nc1nc(Nc2ccc(cc2)C(F)(F)F)ncc1-c1ccc(CN2CCCC2)cn1 |r,wU:4.7,wD:1.0,(-6.52,3.85,;-5.19,3.08,;-5.19,1.54,;-3.85,.77,;-2.52,1.54,;-2.52,3.08,;-3.85,3.85,;-1.18,.77,;-1.18,-.77,;-2.52,-1.54,;-2.52,-3.08,;-3.85,-3.85,;-5.19,-3.08,;-6.52,-3.85,;-7.85,-3.08,;-7.85,-1.54,;-6.52,-.77,;-5.19,-1.54,;-9.19,-.77,;-10.52,-1.54,;-9.19,.77,;-9.19,-2.31,;-1.18,-3.85,;.15,-3.08,;.15,-1.54,;1.48,-.77,;2.82,-1.54,;4.15,-.77,;4.15,.77,;5.48,1.54,;6.82,.77,;6.82,-.77,;8.28,-1.25,;9.19,,;8.28,1.25,;2.82,1.54,;1.48,.77,)|
Show InChI InChI=1S/C27H31F3N6O/c28-27(29,30)19-4-6-21(7-5-19)34-26-32-16-23(25(35-26)33-20-8-10-22(37)11-9-20)24-12-3-18(15-31-24)17-36-13-1-2-14-36/h3-7,12,15-16,20,22,37H,1-2,8-11,13-14,17H2,(H2,32,33,34,35)/t20-,22-
NCI pathway
Reactome pathway
US Patent
n/an/a 6.30n/an/an/an/an/an/a
The University of North Carolina at Chapel Hill
US Patent
Assay Description
Briefly, activity assays were performed in a 384 well, polypropylene microplate in a final volume of 50 μL of 50 mM Hepes, Ph 7.4 containing 10 ...
US Patent US9649309 (2017)
BindingDB Entry DOI: 10.7270/Q26Q209H
Tyrosine-protein kinase receptor TYRO3
(Homo sapiens (Human))
BDBM308336
(US9649309, Compound UNC4243A)
Show SMILES O[C@H]1CC[C@@H](CC1)Nc1nc(Nc2ccc(cc2)C(F)(F)F)ncc1-c1ccc(CN2CCCC2)cn1 |r,wU:4.7,wD:1.0,(-6.52,3.85,;-5.19,3.08,;-5.19,1.54,;-3.85,.77,;-2.52,1.54,;-2.52,3.08,;-3.85,3.85,;-1.18,.77,;-1.18,-.77,;-2.52,-1.54,;-2.52,-3.08,;-3.85,-3.85,;-5.19,-3.08,;-6.52,-3.85,;-7.85,-3.08,;-7.85,-1.54,;-6.52,-.77,;-5.19,-1.54,;-9.19,-.77,;-10.52,-1.54,;-9.19,.77,;-9.19,-2.31,;-1.18,-3.85,;.15,-3.08,;.15,-1.54,;1.48,-.77,;2.82,-1.54,;4.15,-.77,;4.15,.77,;5.48,1.54,;6.82,.77,;6.82,-.77,;8.28,-1.25,;9.19,,;8.28,1.25,;2.82,1.54,;1.48,.77,)|
Show InChI InChI=1S/C27H31F3N6O/c28-27(29,30)19-4-6-21(7-5-19)34-26-32-16-23(25(35-26)33-20-8-10-22(37)11-9-20)24-12-3-18(15-31-24)17-36-13-1-2-14-36/h3-7,12,15-16,20,22,37H,1-2,8-11,13-14,17H2,(H2,32,33,34,35)/t20-,22-
US Patent
n/an/a 13n/an/an/an/an/an/a
The University of North Carolina at Chapel Hill
US Patent
Assay Description
Briefly, activity assays were performed in a 384 well, polypropylene microplate in a final volume of 50 μL of 50 mM Hepes, Ph 7.4 containing 10 ...
US Patent US9649309 (2017)
BindingDB Entry DOI: 10.7270/Q26Q209H
Growth arrest-specific protein 6
(Homo sapiens (Human))
BDBM308336
(US9649309, Compound UNC4243A)
Show SMILES O[C@H]1CC[C@@H](CC1)Nc1nc(Nc2ccc(cc2)C(F)(F)F)ncc1-c1ccc(CN2CCCC2)cn1 |r,wU:4.7,wD:1.0,(-6.52,3.85,;-5.19,3.08,;-5.19,1.54,;-3.85,.77,;-2.52,1.54,;-2.52,3.08,;-3.85,3.85,;-1.18,.77,;-1.18,-.77,;-2.52,-1.54,;-2.52,-3.08,;-3.85,-3.85,;-5.19,-3.08,;-6.52,-3.85,;-7.85,-3.08,;-7.85,-1.54,;-6.52,-.77,;-5.19,-1.54,;-9.19,-.77,;-10.52,-1.54,;-9.19,.77,;-9.19,-2.31,;-1.18,-3.85,;.15,-3.08,;.15,-1.54,;1.48,-.77,;2.82,-1.54,;4.15,-.77,;4.15,.77,;5.48,1.54,;6.82,.77,;6.82,-.77,;8.28,-1.25,;9.19,,;8.28,1.25,;2.82,1.54,;1.48,.77,)|
Show InChI InChI=1S/C27H31F3N6O/c28-27(29,30)19-4-6-21(7-5-19)34-26-32-16-23(25(35-26)33-20-8-10-22(37)11-9-20)24-12-3-18(15-31-24)17-36-13-1-2-14-36/h3-7,12,15-16,20,22,37H,1-2,8-11,13-14,17H2,(H2,32,33,34,35)/t20-,22-
US Patent
n/an/a 3.80n/an/an/an/an/an/a
The University of North Carolina at Chapel Hill
US Patent
Assay Description
Briefly, activity assays were performed in a 384 well, polypropylene microplate in a final volume of 50 μL of 50 mM Hepes, Ph 7.4 containing 10 ...
US Patent US9649309 (2017)
BindingDB Entry DOI: 10.7270/Q26Q209H