BDBM308368 US9649309, Compound UNC4356A
SMILES: CCCCNc1ncc(c(N[C@H]2CC[C@H](O)CC2)n1)-c1ccc(cn1)C1=CCN(C)CC1
InChI Key: InChIKey=CKRMOFCKEANQCR-MEMLXQNLSA-N
Data: 4 IC50
Activity Spreadsheet -- Enzyme Inhibition Constant Data from BindingDB
Found 4 hits for monomerid = 308368
Trg + Lig
Ki
nM
ΔG°
kcal/mole
IC50
nM
Kd
nM
EC50/IC50
nM
koff
s-1
kon
M-1s-1
pHTemp
°C
Receptor-type tyrosine-protein kinase FLT3
(Homo sapiens (Human))
BDBM308368
(US9649309, Compound UNC4356A)
Show SMILES CCCCNc1ncc(c(N[C@H]2CC[C@H](O)CC2)n1)-c1ccc(cn1)C1=CCN(C)CC1 |r,wU:11.10,wD:14.14,t:28,(-9.34,-3.85,;-8,-3.08,;-6.67,-3.85,;-5.33,-3.08,;-4,-3.85,;-2.67,-3.08,;-1.33,-3.85,;,-3.08,;,-1.54,;-1.33,-.77,;-1.33,.77,;-2.67,1.54,;-4,.77,;-5.33,1.54,;-5.33,3.08,;-6.67,3.85,;-4,3.85,;-2.67,3.08,;-2.67,-1.54,;1.33,-.77,;2.67,-1.54,;4,-.77,;4,.77,;2.67,1.54,;1.33,.77,;5.33,1.54,;5.33,3.08,;6.67,3.85,;8,3.08,;9.34,3.85,;8,1.54,;6.67,.77,)|
Show InChI InChI=1S/C25H36N6O/c1-3-4-13-26-25-28-17-22(24(30-25)29-20-6-8-21(32)9-7-20)23-10-5-19(16-27-23)18-11-14-31(2)15-12-18/h5,10-11,16-17,20-21,32H,3-4,6-9,12-15H2,1-2H3,(H2,26,28,29,30)/t20-,21-
US Patent
n/an/a 3.30n/an/an/an/an/an/a
The University of North Carolina at Chapel Hill
US Patent
Assay Description
Briefly, activity assays were performed in a 384 well, polypropylene microplate in a final volume of 50 μL of 50 mM Hepes, Ph 7.4 containing 10 ...
US Patent US9649309 (2017)
BindingDB Entry DOI: 10.7270/Q26Q209H
Tyrosine-protein kinase receptor TYRO3
(Homo sapiens (Human))
BDBM308368
(US9649309, Compound UNC4356A)
Show SMILES CCCCNc1ncc(c(N[C@H]2CC[C@H](O)CC2)n1)-c1ccc(cn1)C1=CCN(C)CC1 |r,wU:11.10,wD:14.14,t:28,(-9.34,-3.85,;-8,-3.08,;-6.67,-3.85,;-5.33,-3.08,;-4,-3.85,;-2.67,-3.08,;-1.33,-3.85,;,-3.08,;,-1.54,;-1.33,-.77,;-1.33,.77,;-2.67,1.54,;-4,.77,;-5.33,1.54,;-5.33,3.08,;-6.67,3.85,;-4,3.85,;-2.67,3.08,;-2.67,-1.54,;1.33,-.77,;2.67,-1.54,;4,-.77,;4,.77,;2.67,1.54,;1.33,.77,;5.33,1.54,;5.33,3.08,;6.67,3.85,;8,3.08,;9.34,3.85,;8,1.54,;6.67,.77,)|
Show InChI InChI=1S/C25H36N6O/c1-3-4-13-26-25-28-17-22(24(30-25)29-20-6-8-21(32)9-7-20)23-10-5-19(16-27-23)18-11-14-31(2)15-12-18/h5,10-11,16-17,20-21,32H,3-4,6-9,12-15H2,1-2H3,(H2,26,28,29,30)/t20-,21-
US Patent
n/an/a 38n/an/an/an/an/an/a
The University of North Carolina at Chapel Hill
US Patent
Assay Description
Briefly, activity assays were performed in a 384 well, polypropylene microplate in a final volume of 50 μL of 50 mM Hepes, Ph 7.4 containing 10 ...
US Patent US9649309 (2017)
BindingDB Entry DOI: 10.7270/Q26Q209H
Growth arrest-specific protein 6
(Homo sapiens (Human))
BDBM308368
(US9649309, Compound UNC4356A)
Show SMILES CCCCNc1ncc(c(N[C@H]2CC[C@H](O)CC2)n1)-c1ccc(cn1)C1=CCN(C)CC1 |r,wU:11.10,wD:14.14,t:28,(-9.34,-3.85,;-8,-3.08,;-6.67,-3.85,;-5.33,-3.08,;-4,-3.85,;-2.67,-3.08,;-1.33,-3.85,;,-3.08,;,-1.54,;-1.33,-.77,;-1.33,.77,;-2.67,1.54,;-4,.77,;-5.33,1.54,;-5.33,3.08,;-6.67,3.85,;-4,3.85,;-2.67,3.08,;-2.67,-1.54,;1.33,-.77,;2.67,-1.54,;4,-.77,;4,.77,;2.67,1.54,;1.33,.77,;5.33,1.54,;5.33,3.08,;6.67,3.85,;8,3.08,;9.34,3.85,;8,1.54,;6.67,.77,)|
Show InChI InChI=1S/C25H36N6O/c1-3-4-13-26-25-28-17-22(24(30-25)29-20-6-8-21(32)9-7-20)23-10-5-19(16-27-23)18-11-14-31(2)15-12-18/h5,10-11,16-17,20-21,32H,3-4,6-9,12-15H2,1-2H3,(H2,26,28,29,30)/t20-,21-
US Patent
n/an/a 56n/an/an/an/an/an/a
The University of North Carolina at Chapel Hill
US Patent
Assay Description
Briefly, activity assays were performed in a 384 well, polypropylene microplate in a final volume of 50 μL of 50 mM Hepes, Ph 7.4 containing 10 ...
US Patent US9649309 (2017)
BindingDB Entry DOI: 10.7270/Q26Q209H
Tyrosine-protein kinase Mer
(Homo sapiens (Human))
BDBM308368
(US9649309, Compound UNC4356A)
Show SMILES CCCCNc1ncc(c(N[C@H]2CC[C@H](O)CC2)n1)-c1ccc(cn1)C1=CCN(C)CC1 |r,wU:11.10,wD:14.14,t:28,(-9.34,-3.85,;-8,-3.08,;-6.67,-3.85,;-5.33,-3.08,;-4,-3.85,;-2.67,-3.08,;-1.33,-3.85,;,-3.08,;,-1.54,;-1.33,-.77,;-1.33,.77,;-2.67,1.54,;-4,.77,;-5.33,1.54,;-5.33,3.08,;-6.67,3.85,;-4,3.85,;-2.67,3.08,;-2.67,-1.54,;1.33,-.77,;2.67,-1.54,;4,-.77,;4,.77,;2.67,1.54,;1.33,.77,;5.33,1.54,;5.33,3.08,;6.67,3.85,;8,3.08,;9.34,3.85,;8,1.54,;6.67,.77,)|
Show InChI InChI=1S/C25H36N6O/c1-3-4-13-26-25-28-17-22(24(30-25)29-20-6-8-21(32)9-7-20)23-10-5-19(16-27-23)18-11-14-31(2)15-12-18/h5,10-11,16-17,20-21,32H,3-4,6-9,12-15H2,1-2H3,(H2,26,28,29,30)/t20-,21-
Reactome pathway
US Patent
n/an/a 1.30n/an/an/an/an/an/a
The University of North Carolina at Chapel Hill
US Patent
Assay Description
Briefly, activity assays were performed in a 384 well, polypropylene microplate in a final volume of 50 μL of 50 mM Hepes, Ph 7.4 containing 10 ...
US Patent US9649309 (2017)
BindingDB Entry DOI: 10.7270/Q26Q209H