BDBM3092 2-aminopyrido[2,3-d]pyrimidin-7(8H)-one 59::6-(2,6-Dichlorophenyl)-2-[4-(2-ethylaminoethoxy)phenylamino]-8-methyl-8H-pyrido[2,3-d]pyrimidin-7-one, Dihydrochloride::6-(2,6-dichlorophenyl)-2-({4-[2-(ethylamino)ethoxy]phenyl}amino)-8-methyl-7H,8H-pyrido[2,3-d]pyrimidin-7-one::PD 166285 analog
SMILES: CCNCCOc1ccc(Nc2ncc3cc(-c4c(Cl)cccc4Cl)c(=O)n(C)c3n2)cc1
InChI Key: InChIKey=HNDIVAFUXDXTDZ-UHFFFAOYSA-N
Data: 3 IC50
Activity Spreadsheet -- Enzyme Inhibition Constant Data from BindingDB
Found 3 hits for monomerid = 3092
Trg + Lig
Ki
nM
ΔG°
kcal/mole
IC50
nM
Kd
nM
EC50/IC50
nM
koff
s-1
kon
M-1s-1
pHTemp
°C
Platelet-derived growth factor receptor beta
(Homo sapiens (Human))
BDBM3092
(2-aminopyrido[2,3-d]pyrimidin-7(8H)-one 59 | 6-(2,...)
Show SMILES CCNCCOc1ccc(Nc2ncc3cc(-c4c(Cl)cccc4Cl)c(=O)n(C)c3n2)cc1 |(-2.66,-9.3,;-4.15,-8.9,;-5.48,-9.67,;-6.82,-8.9,;-6.82,-7.36,;-8.15,-6.59,;-8.15,-5.05,;-6.82,-4.28,;-6.82,-2.74,;-8.15,-1.97,;-8.15,-.43,;-6.82,.34,;-6.82,1.88,;-5.48,2.65,;-4.15,1.88,;-2.82,2.65,;-1.48,1.88,;-.15,2.65,;-.15,4.19,;-1.48,4.96,;1.18,4.96,;2.52,4.19,;2.52,2.65,;1.18,1.88,;1.18,.34,;-1.48,.34,;-.15,-.43,;-2.82,-.43,;-2.82,-1.97,;-4.15,.34,;-5.48,-.43,;-9.48,-2.74,;-9.48,-4.28,)|
Show InChI InChI=1S/C24H23Cl2N5O2/c1-3-27-11-12-33-17-9-7-16(8-10-17)29-24-28-14-15-13-18(23(32)31(2)22(15)30-24)21-19(25)5-4-6-20(21)26/h4-10,13-14,27H,3,11-12H2,1-2H3,(H,28,29,30)
NCI pathway
Reactome pathway
n/an/a 190n/an/an/an/an/an/a
Parke-Davis Pharmaceutical Research
Assay Description
IC50 is the inhibitor concentration which inhibits 50% of kinase activity that catalyzes the transfer of the terminal phosphate from [gamma-32P] labe...
J Med Chem 41: 3276-92 (1998)
Article DOI: 10.1021/jm9802259
BindingDB Entry DOI: 10.7270/Q27P8WK3
Proto-oncogene tyrosine-protein kinase Src
(Homo sapiens (Human))
BDBM3092
(2-aminopyrido[2,3-d]pyrimidin-7(8H)-one 59 | 6-(2,...)
Show SMILES CCNCCOc1ccc(Nc2ncc3cc(-c4c(Cl)cccc4Cl)c(=O)n(C)c3n2)cc1 |(-2.66,-9.3,;-4.15,-8.9,;-5.48,-9.67,;-6.82,-8.9,;-6.82,-7.36,;-8.15,-6.59,;-8.15,-5.05,;-6.82,-4.28,;-6.82,-2.74,;-8.15,-1.97,;-8.15,-.43,;-6.82,.34,;-6.82,1.88,;-5.48,2.65,;-4.15,1.88,;-2.82,2.65,;-1.48,1.88,;-.15,2.65,;-.15,4.19,;-1.48,4.96,;1.18,4.96,;2.52,4.19,;2.52,2.65,;1.18,1.88,;1.18,.34,;-1.48,.34,;-.15,-.43,;-2.82,-.43,;-2.82,-1.97,;-4.15,.34,;-5.48,-.43,;-9.48,-2.74,;-9.48,-4.28,)|
Show InChI InChI=1S/C24H23Cl2N5O2/c1-3-27-11-12-33-17-9-7-16(8-10-17)29-24-28-14-15-13-18(23(32)31(2)22(15)30-24)21-19(25)5-4-6-20(21)26/h4-10,13-14,27H,3,11-12H2,1-2H3,(H,28,29,30)
n/an/a 15n/an/an/an/an/an/a
Parke-Davis Pharmaceutical Research
Assay Description
IC50 is the inhibitor concentration which inhibits 50% of kinase activity that catalyzes the transfer of the terminal phosphate from [gamma-32P] labe...
J Med Chem 41: 3276-92 (1998)
Article DOI: 10.1021/jm9802259
BindingDB Entry DOI: 10.7270/Q27P8WK3
Fibroblast growth factor receptor 1
(Homo sapiens (Human))
BDBM3092
(2-aminopyrido[2,3-d]pyrimidin-7(8H)-one 59 | 6-(2,...)
Show SMILES CCNCCOc1ccc(Nc2ncc3cc(-c4c(Cl)cccc4Cl)c(=O)n(C)c3n2)cc1 |(-2.66,-9.3,;-4.15,-8.9,;-5.48,-9.67,;-6.82,-8.9,;-6.82,-7.36,;-8.15,-6.59,;-8.15,-5.05,;-6.82,-4.28,;-6.82,-2.74,;-8.15,-1.97,;-8.15,-.43,;-6.82,.34,;-6.82,1.88,;-5.48,2.65,;-4.15,1.88,;-2.82,2.65,;-1.48,1.88,;-.15,2.65,;-.15,4.19,;-1.48,4.96,;1.18,4.96,;2.52,4.19,;2.52,2.65,;1.18,1.88,;1.18,.34,;-1.48,.34,;-.15,-.43,;-2.82,-.43,;-2.82,-1.97,;-4.15,.34,;-5.48,-.43,;-9.48,-2.74,;-9.48,-4.28,)|
Show InChI InChI=1S/C24H23Cl2N5O2/c1-3-27-11-12-33-17-9-7-16(8-10-17)29-24-28-14-15-13-18(23(32)31(2)22(15)30-24)21-19(25)5-4-6-20(21)26/h4-10,13-14,27H,3,11-12H2,1-2H3,(H,28,29,30)
NCI pathway
Reactome pathway
n/an/a 66n/an/an/an/an/an/a
Parke-Davis Pharmaceutical Research
Assay Description
IC50 is the inhibitor concentration which inhibits 50% of kinase activity that catalyzes the transfer of the terminal phosphate from [gamma-32P] labe...
J Med Chem 41: 3276-92 (1998)
Article DOI: 10.1021/jm9802259
BindingDB Entry DOI: 10.7270/Q27P8WK3