BDBM309407 US10231963, Table B.10::US10736890, Compound TABLE B.10::US9656961, Example 00127
SMILES: CCCCCCN1CCC(CC1)(C(=O)N(C)CC)c1ccccc1
InChI Key: InChIKey=TYWUGCGYWNSRPS-UHFFFAOYSA-N
Data: 3 KI  2 EC50
Activity Spreadsheet -- Enzyme Inhibition Constant Data from BindingDB
Found 5 hits for monomerid = 309407
Trg + Lig
Ki
nM
ΔG°
kcal/mole
IC50
nM
Kd
nM
EC50/IC50
nM
koff
s-1
kon
M-1s-1
pHTemp
°C
Mu-type opioid receptor
(Homo sapiens (Human))
BDBM309407
(US10231963, Table B.10 | US10736890, Compound TABL...)
Show SMILES CCCCCCN1CCC(CC1)(C(=O)N(C)CC)c1ccccc1
Show InChI InChI=1S/C21H34N2O/c1-4-6-7-11-16-23-17-14-21(15-18-23,20(24)22(3)5-2)19-12-9-8-10-13-19/h8-10,12-13H,4-7,11,14-18H2,1-3H3
NCI pathway
Reactome pathway
US Patent
22n/an/an/an/an/an/an/an/a
ALKERMES PHARMA IRELAND LIMITED
US Patent
Assay Description
The Ki (binding affinity) for opioid receptors was determined using a competitive displacement assay as previously described in Neumeyer (Journal of ...
US Patent US9656961 (2017)
BindingDB Entry DOI: 10.7270/Q2PR7Z13
Mu-type opioid receptor
(Homo sapiens (Human))
BDBM309407
(US10231963, Table B.10 | US10736890, Compound TABL...)
Show SMILES CCCCCCN1CCC(CC1)(C(=O)N(C)CC)c1ccccc1
Show InChI InChI=1S/C21H34N2O/c1-4-6-7-11-16-23-17-14-21(15-18-23,20(24)22(3)5-2)19-12-9-8-10-13-19/h8-10,12-13H,4-7,11,14-18H2,1-3H3
NCI pathway
Reactome pathway
US Patent
22n/an/an/an/an/an/an/an/a
Universita degli Studi di Bari
Assay Description
The Ki (binding affinity) for opioid receptors was determined using a competitive displacement assay as previously described in Neumeyer (Journal of ...
J Med Chem 50: 4214-21 (2007)
BindingDB Entry DOI: 10.7270/Q2W66P26
Mu-type opioid receptor
(Homo sapiens (Human))
BDBM309407
(US10231963, Table B.10 | US10736890, Compound TABL...)
Show SMILES CCCCCCN1CCC(CC1)(C(=O)N(C)CC)c1ccccc1
Show InChI InChI=1S/C21H34N2O/c1-4-6-7-11-16-23-17-14-21(15-18-23,20(24)22(3)5-2)19-12-9-8-10-13-19/h8-10,12-13H,4-7,11,14-18H2,1-3H3
NCI pathway
Reactome pathway
US Patent
22n/an/an/an/an/an/an/an/a
ALKERMES PHARMA IRELAND LIMITED
US Patent
Assay Description
The Ki (binding affinity) for μ opioid receptors was determined using a competitive displacement assay as previously described in Neumeyer (Jour...
US Patent US10736890 (2020)
Mu-type opioid receptor
(Homo sapiens (Human))
BDBM309407
(US10231963, Table B.10 | US10736890, Compound TABL...)
Show SMILES CCCCCCN1CCC(CC1)(C(=O)N(C)CC)c1ccccc1
Show InChI InChI=1S/C21H34N2O/c1-4-6-7-11-16-23-17-14-21(15-18-23,20(24)22(3)5-2)19-12-9-8-10-13-19/h8-10,12-13H,4-7,11,14-18H2,1-3H3
NCI pathway
Reactome pathway
US Patent
n/an/an/an/a>630n/an/an/an/a
Universita degli Studi di Bari
Assay Description
The Ki (binding affinity) for opioid receptors was determined using a competitive displacement assay as previously described in Neumeyer (Journal of ...
J Med Chem 50: 4214-21 (2007)
BindingDB Entry DOI: 10.7270/Q2W66P26
Mu-type opioid receptor
(Homo sapiens (Human))
BDBM309407
(US10231963, Table B.10 | US10736890, Compound TABL...)
Show SMILES CCCCCCN1CCC(CC1)(C(=O)N(C)CC)c1ccccc1
Show InChI InChI=1S/C21H34N2O/c1-4-6-7-11-16-23-17-14-21(15-18-23,20(24)22(3)5-2)19-12-9-8-10-13-19/h8-10,12-13H,4-7,11,14-18H2,1-3H3
NCI pathway
Reactome pathway
US Patent
n/an/an/an/a>630n/an/an/an/a
ALKERMES PHARMA IRELAND LIMITED
US Patent
Assay Description
The Ki (binding affinity) for opioid receptors was determined using a competitive displacement assay as previously described in Neumeyer (Journal of ...
US Patent US9656961 (2017)
BindingDB Entry DOI: 10.7270/Q2PR7Z13