BDBM309412 US10231963, Table B.15::US9656961, Example 00132
SMILES: CO[C@]12CC[C@@]3(C[C@@H]1[C@](C)(O)C(C)(C)C)[C@H]1Cc4ccc(C(N)=O)c5O[C@@H]2[C@]3(CCN1CC1CC1)c45
InChI Key: InChIKey=PNSGSIISNKYAEX-VXVNZLIHSA-N
Data: 2 KI  2 IC50  2 EC50
Activity Spreadsheet -- Enzyme Inhibition Constant Data from BindingDB
Found 6 hits for monomerid = 309412
Trg + Lig
Ki
nM
ΔG°
kcal/mole
IC50
nM
Kd
nM
EC50/IC50
nM
koff
s-1
kon
M-1s-1
pHTemp
°C
Mu-type opioid receptor
(Homo sapiens (Human))
BDBM309412
(US10231963, Table B.15 | US9656961, Example 00132)
Show SMILES CO[C@]12CC[C@@]3(C[C@@H]1[C@](C)(O)C(C)(C)C)[C@H]1Cc4ccc(C(N)=O)c5O[C@@H]2[C@]3(CCN1CC1CC1)c45 |r,TLB:8:7:27.26:4.3|
Show InChI InChI=1S/C30H42N2O4/c1-26(2,3)27(4,34)20-15-28-10-11-30(20,35-5)25-29(28)12-13-32(16-17-6-7-17)21(28)14-18-8-9-19(24(31)33)23(36-25)22(18)29/h8-9,17,20-21,25,34H,6-7,10-16H2,1-5H3,(H2,31,33)/t20-,21-,25-,27+,28-,29+,30-/m1/s1
NCI pathway
Reactome pathway
US Patent
0.770n/an/an/an/an/an/an/an/a
ALKERMES PHARMA IRELAND LIMITED
US Patent
Assay Description
The Ki (binding affinity) for opioid receptors was determined using a competitive displacement assay as previously described in Neumeyer (Journal of ...
US Patent US9656961 (2017)
BindingDB Entry DOI: 10.7270/Q2PR7Z13
Mu-type opioid receptor
(Homo sapiens (Human))
BDBM309412
(US10231963, Table B.15 | US9656961, Example 00132)
Show SMILES CO[C@]12CC[C@@]3(C[C@@H]1[C@](C)(O)C(C)(C)C)[C@H]1Cc4ccc(C(N)=O)c5O[C@@H]2[C@]3(CCN1CC1CC1)c45 |r,TLB:8:7:27.26:4.3|
Show InChI InChI=1S/C30H42N2O4/c1-26(2,3)27(4,34)20-15-28-10-11-30(20,35-5)25-29(28)12-13-32(16-17-6-7-17)21(28)14-18-8-9-19(24(31)33)23(36-25)22(18)29/h8-9,17,20-21,25,34H,6-7,10-16H2,1-5H3,(H2,31,33)/t20-,21-,25-,27+,28-,29+,30-/m1/s1
NCI pathway
Reactome pathway
US Patent
0.770n/an/an/an/an/an/an/an/a
Universita degli Studi di Bari
Assay Description
The Ki (binding affinity) for opioid receptors was determined using a competitive displacement assay as previously described in Neumeyer (Journal of ...
J Med Chem 50: 4214-21 (2007)
BindingDB Entry DOI: 10.7270/Q2W66P26
Mu-type opioid receptor
(Homo sapiens (Human))
BDBM309412
(US10231963, Table B.15 | US9656961, Example 00132)
Show SMILES CO[C@]12CC[C@@]3(C[C@@H]1[C@](C)(O)C(C)(C)C)[C@H]1Cc4ccc(C(N)=O)c5O[C@@H]2[C@]3(CCN1CC1CC1)c45 |r,TLB:8:7:27.26:4.3|
Show InChI InChI=1S/C30H42N2O4/c1-26(2,3)27(4,34)20-15-28-10-11-30(20,35-5)25-29(28)12-13-32(16-17-6-7-17)21(28)14-18-8-9-19(24(31)33)23(36-25)22(18)29/h8-9,17,20-21,25,34H,6-7,10-16H2,1-5H3,(H2,31,33)/t20-,21-,25-,27+,28-,29+,30-/m1/s1
NCI pathway
Reactome pathway
US Patent
n/an/an/an/a 1.80n/an/an/an/a
Universita degli Studi di Bari
Assay Description
The Ki (binding affinity) for opioid receptors was determined using a competitive displacement assay as previously described in Neumeyer (Journal of ...
J Med Chem 50: 4214-21 (2007)
BindingDB Entry DOI: 10.7270/Q2W66P26
Mu-type opioid receptor
(Homo sapiens (Human))
BDBM309412
(US10231963, Table B.15 | US9656961, Example 00132)
Show SMILES CO[C@]12CC[C@@]3(C[C@@H]1[C@](C)(O)C(C)(C)C)[C@H]1Cc4ccc(C(N)=O)c5O[C@@H]2[C@]3(CCN1CC1CC1)c45 |r,TLB:8:7:27.26:4.3|
Show InChI InChI=1S/C30H42N2O4/c1-26(2,3)27(4,34)20-15-28-10-11-30(20,35-5)25-29(28)12-13-32(16-17-6-7-17)21(28)14-18-8-9-19(24(31)33)23(36-25)22(18)29/h8-9,17,20-21,25,34H,6-7,10-16H2,1-5H3,(H2,31,33)/t20-,21-,25-,27+,28-,29+,30-/m1/s1
NCI pathway
Reactome pathway
US Patent
n/an/a 1.60n/an/an/an/an/an/a
Universita degli Studi di Bari
Assay Description
The Ki (binding affinity) for opioid receptors was determined using a competitive displacement assay as previously described in Neumeyer (Journal of ...
J Med Chem 50: 4214-21 (2007)
BindingDB Entry DOI: 10.7270/Q2W66P26
Mu-type opioid receptor
(Homo sapiens (Human))
BDBM309412
(US10231963, Table B.15 | US9656961, Example 00132)
Show SMILES CO[C@]12CC[C@@]3(C[C@@H]1[C@](C)(O)C(C)(C)C)[C@H]1Cc4ccc(C(N)=O)c5O[C@@H]2[C@]3(CCN1CC1CC1)c45 |r,TLB:8:7:27.26:4.3|
Show InChI InChI=1S/C30H42N2O4/c1-26(2,3)27(4,34)20-15-28-10-11-30(20,35-5)25-29(28)12-13-32(16-17-6-7-17)21(28)14-18-8-9-19(24(31)33)23(36-25)22(18)29/h8-9,17,20-21,25,34H,6-7,10-16H2,1-5H3,(H2,31,33)/t20-,21-,25-,27+,28-,29+,30-/m1/s1
NCI pathway
Reactome pathway
US Patent
n/an/an/an/a 1.80n/an/an/an/a
ALKERMES PHARMA IRELAND LIMITED
US Patent
Assay Description
The Ki (binding affinity) for opioid receptors was determined using a competitive displacement assay as previously described in Neumeyer (Journal of ...
US Patent US9656961 (2017)
BindingDB Entry DOI: 10.7270/Q2PR7Z13
Mu-type opioid receptor
(Homo sapiens (Human))
BDBM309412
(US10231963, Table B.15 | US9656961, Example 00132)
Show SMILES CO[C@]12CC[C@@]3(C[C@@H]1[C@](C)(O)C(C)(C)C)[C@H]1Cc4ccc(C(N)=O)c5O[C@@H]2[C@]3(CCN1CC1CC1)c45 |r,TLB:8:7:27.26:4.3|
Show InChI InChI=1S/C30H42N2O4/c1-26(2,3)27(4,34)20-15-28-10-11-30(20,35-5)25-29(28)12-13-32(16-17-6-7-17)21(28)14-18-8-9-19(24(31)33)23(36-25)22(18)29/h8-9,17,20-21,25,34H,6-7,10-16H2,1-5H3,(H2,31,33)/t20-,21-,25-,27+,28-,29+,30-/m1/s1
NCI pathway
Reactome pathway
US Patent
n/an/a 1.60n/an/an/an/an/an/a
ALKERMES PHARMA IRELAND LIMITED
US Patent
Assay Description
The Ki (binding affinity) for opioid receptors was determined using a competitive displacement assay as previously described in Neumeyer (Journal of ...
US Patent US9656961 (2017)
BindingDB Entry DOI: 10.7270/Q2PR7Z13