BDBM309469 (2R,4S)-5-(3′-Chloro-biphenyl-4-yl)-4-[(3-hydroxy-isoxazole-5-carbonyl)-amino]-2-methyl-pentanoic acid::US9603819, Example 49-1
SMILES: C[C@H](C[C@@H](Cc1ccc(cc1)-c1cccc(Cl)c1)NC(=O)C(\O)=C\C(O)=N)C(O)=O
InChI Key: InChIKey=NXKMMJWYSKJXAI-ZBCMPGPASA-N
Data: 1 IC50
Activity Spreadsheet -- Enzyme Inhibition Constant Data from BindingDB
Found 1 hit for monomerid = 309469
Trg + Lig
Ki
nM
ΔG°
kcal/mole
IC50
nM
Kd
nM
EC50/IC50
nM
koff
s-1
kon
M-1s-1
pHTemp
°C
Neprilysin
(Homo sapiens (Human))
BDBM309469
((2R,4S)-5-(3′-Chloro-biphenyl-4-yl)-4-[(3-hy...)
Show SMILES C[C@H](C[C@@H](Cc1ccc(cc1)-c1cccc(Cl)c1)NC(=O)C(\O)=C\C(O)=N)C(O)=O |r|
Show InChI InChI=1S/C22H23ClN2O5/c1-13(22(29)30)9-18(25-21(28)19(26)12-20(24)27)10-14-5-7-15(8-6-14)16-3-2-4-17(23)11-16/h2-8,11-13,18,26H,9-10H2,1H3,(H2,24,27)(H,25,28)(H,29,30)/b19-12-/t13-,18+/m1/s1
US Patent
n/an/a 0.0400n/an/an/an/an/an/a
NOVARTIS AG
US Patent
Assay Description
The activity of a compound according to the present invention can be assessed by the following in vitro & in vivo methods and/or by the following in ...
US Patent US9603819 (2017)
BindingDB Entry DOI: 10.7270/Q20V8FVV