BDBM309481 US9603833, Example 99
SMILES: CC(=O)N1CCN(CC1)c1ccc(CCc2ccc(CC(=O)NN)cc2)nn1
InChI Key: InChIKey=SIMBJCUGWLYINP-UHFFFAOYSA-N
Data: 2 IC50
Activity Spreadsheet -- Enzyme Inhibition Constant Data from BindingDB
Found 2 hits for monomerid = 309481
Trg + Lig
Ki
nM
ΔG°
kcal/mole
IC50
nM
Kd
nM
EC50/IC50
nM
koff
s-1
kon
M-1s-1
pHTemp
°C
Membrane primary amine oxidase
(Rattus norvegicus (Rat))
BDBM309481
(US9603833, Example 99)
Show SMILES CC(=O)N1CCN(CC1)c1ccc(CCc2ccc(CC(=O)NN)cc2)nn1
Show InChI InChI=1S/C20H26N6O2/c1-15(27)25-10-12-26(13-11-25)19-9-8-18(23-24-19)7-6-16-2-4-17(5-3-16)14-20(28)22-21/h2-5,8-9H,6-7,10-14,21H2,1H3,(H,22,28)
US Patent
n/an/a 2.5n/an/an/an/an/an/a
R-Tech Ueno, Ltd.
US Patent
Assay Description
The compounds of the present invention obtained in Production Examples were examined for the inhibitory effect on human and rat VAP-1 enzyme (SSAO) b...
US Patent US9603833 (2017)
BindingDB Entry DOI: 10.7270/Q2W37ZCW
Membrane primary amine oxidase
(Homo sapiens (Human))
BDBM309481
(US9603833, Example 99)
Show SMILES CC(=O)N1CCN(CC1)c1ccc(CCc2ccc(CC(=O)NN)cc2)nn1
Show InChI InChI=1S/C20H26N6O2/c1-15(27)25-10-12-26(13-11-25)19-9-8-18(23-24-19)7-6-16-2-4-17(5-3-16)14-20(28)22-21/h2-5,8-9H,6-7,10-14,21H2,1H3,(H,22,28)
US Patent
n/an/a 13.5n/an/an/an/an/an/a
R-Tech Ueno, Ltd.
US Patent
Assay Description
The compounds of the present invention obtained in Production Examples were examined for the inhibitory effect on human and rat VAP-1 enzyme (SSAO) b...
US Patent US9603833 (2017)
BindingDB Entry DOI: 10.7270/Q2W37ZCW