null
SMILES: CC(=O)N1CCN(CC1)c1ccc(CCc2ccc(CCOC(=O)NN)cc2)nc1
InChI Key: InChIKey=QVNYGWVYPHUOPS-UHFFFAOYSA-N
Activity Spreadsheet -- Enzyme Inhibition Constant Data from BindingDB
Found 2 hits for monomerid = 309499
Trg + Lig
Ki
nM
ΔG°
kcal/mole
IC50
nM
Kd
nM
EC50/IC50
nM
koff
s-1
kon
M-1s-1
pHTemp
°C
Membrane primary amine oxidase
(Rattus norvegicus (Rat))
BDBM309499
(US9603833, Example 122)
Show SMILES CC(=O)N1CCN(CC1)c1ccc(CCc2ccc(CCOC(=O)NN)cc2)nc1
Show InChI InChI=1S/C22H29N5O3/c1-17(28)26-11-13-27(14-12-26)21-9-8-20(24-16-21)7-6-18-2-4-19(5-3-18)10-15-30-22(29)25-23/h2-5,8-9,16H,6-7,10-15,23H2,1H3,(H,25,29)
US Patent
n/an/a 8n/an/an/an/an/an/a
R-Tech Ueno, Ltd.
US Patent
Assay Description
The compounds of the present invention obtained in Production Examples were examined for the inhibitory effect on human and rat VAP-1 enzyme (SSAO) b...
US Patent US9603833 (2017)
BindingDB Entry DOI: 10.7270/Q2W37ZCW
Membrane primary amine oxidase
(Homo sapiens (Human))
BDBM309499
(US9603833, Example 122)
Show SMILES CC(=O)N1CCN(CC1)c1ccc(CCc2ccc(CCOC(=O)NN)cc2)nc1
Show InChI InChI=1S/C22H29N5O3/c1-17(28)26-11-13-27(14-12-26)21-9-8-20(24-16-21)7-6-18-2-4-19(5-3-18)10-15-30-22(29)25-23/h2-5,8-9,16H,6-7,10-15,23H2,1H3,(H,25,29)
US Patent
n/an/a 6.60n/an/an/an/an/an/a
R-Tech Ueno, Ltd.
US Patent
Assay Description
The compounds of the present invention obtained in Production Examples were examined for the inhibitory effect on human and rat VAP-1 enzyme (SSAO) b...
US Patent US9603833 (2017)
BindingDB Entry DOI: 10.7270/Q2W37ZCW