BDBM3098 (2-{4-[6-(2,6-Dichloro-phenyl)-8-methyl-7-oxo-7,8-dihydro-pyrido[2,3-d]pyrimidin-2-ylamino]phenoxy}ethyl)diethylmethylammonium Iodide::2-aminopyrido[2,3-d]pyrimidin-7(8H)-one 65::PD 166285 analog::[2-(4-{[6-(2,6-dichlorophenyl)-8-methyl-7-oxo-7H,8H-pyrido[2,3-d]pyrimidin-2-yl]amino}phenoxy)ethyl]diethylmethylazanium iodide
SMILES: CC[N+](C)(CC)CCOc1ccc(Nc2ncc3cc(-c4c(Cl)cccc4Cl)c(=O)n(C)c3n2)cc1
InChI Key: InChIKey=PKKMIHJGXZABIL-UHFFFAOYSA-O
Data: 2 IC50
Activity Spreadsheet -- Enzyme Inhibition Constant Data from BindingDB
Found 2 hits for monomerid = 3098
Trg + Lig
Ki
nM
ΔG°
kcal/mole
IC50
nM
Kd
nM
EC50/IC50
nM
koff
s-1
kon
M-1s-1
pHTemp
°C
Fibroblast growth factor receptor 1
(Homo sapiens (Human))
BDBM3098
((2-{4-[6-(2,6-Dichloro-phenyl)-8-methyl-7-oxo-7,8-...)
Show SMILES CC[N+](C)(CC)CCOc1ccc(Nc2ncc3cc(-c4c(Cl)cccc4Cl)c(=O)n(C)c3n2)cc1 |(-2.82,-5.05,;-2.82,-6.59,;-4.15,-7.36,;-2.82,-8.13,;-4.15,-8.9,;-5.48,-9.67,;-5.48,-6.59,;-6.82,-7.36,;-8.15,-6.59,;-8.15,-5.05,;-6.82,-4.28,;-6.82,-2.74,;-8.15,-1.97,;-8.15,-.43,;-6.82,.34,;-6.82,1.88,;-5.48,2.65,;-4.15,1.88,;-2.82,2.65,;-1.48,1.88,;-.15,2.65,;-.15,4.19,;-1.48,4.96,;1.18,4.96,;2.52,4.19,;2.52,2.65,;1.18,1.88,;1.18,.34,;-1.48,.34,;-.15,-.43,;-2.82,-.43,;-2.82,-1.97,;-4.15,.34,;-5.48,-.43,;-9.48,-2.74,;-9.48,-4.28,)|
Show InChI InChI=1S/C27H29Cl2N5O2/c1-5-34(4,6-2)14-15-36-20-12-10-19(11-13-20)31-27-30-17-18-16-21(26(35)33(3)25(18)32-27)24-22(28)8-7-9-23(24)29/h7-13,16-17H,5-6,14-15H2,1-4H3/p+1
NCI pathway
Reactome pathway
n/an/a 40n/an/an/an/an/an/a
Parke-Davis Pharmaceutical Research
Assay Description
IC50 is the inhibitor concentration which inhibits 50% of kinase activity that catalyzes the transfer of the terminal phosphate from [gamma-32P] labe...
J Med Chem 41: 3276-92 (1998)
Article DOI: 10.1021/jm9802259
BindingDB Entry DOI: 10.7270/Q27P8WK3
Platelet-derived growth factor receptor beta
(Homo sapiens (Human))
BDBM3098
((2-{4-[6-(2,6-Dichloro-phenyl)-8-methyl-7-oxo-7,8-...)
Show SMILES CC[N+](C)(CC)CCOc1ccc(Nc2ncc3cc(-c4c(Cl)cccc4Cl)c(=O)n(C)c3n2)cc1 |(-2.82,-5.05,;-2.82,-6.59,;-4.15,-7.36,;-2.82,-8.13,;-4.15,-8.9,;-5.48,-9.67,;-5.48,-6.59,;-6.82,-7.36,;-8.15,-6.59,;-8.15,-5.05,;-6.82,-4.28,;-6.82,-2.74,;-8.15,-1.97,;-8.15,-.43,;-6.82,.34,;-6.82,1.88,;-5.48,2.65,;-4.15,1.88,;-2.82,2.65,;-1.48,1.88,;-.15,2.65,;-.15,4.19,;-1.48,4.96,;1.18,4.96,;2.52,4.19,;2.52,2.65,;1.18,1.88,;1.18,.34,;-1.48,.34,;-.15,-.43,;-2.82,-.43,;-2.82,-1.97,;-4.15,.34,;-5.48,-.43,;-9.48,-2.74,;-9.48,-4.28,)|
Show InChI InChI=1S/C27H29Cl2N5O2/c1-5-34(4,6-2)14-15-36-20-12-10-19(11-13-20)31-27-30-17-18-16-21(26(35)33(3)25(18)32-27)24-22(28)8-7-9-23(24)29/h7-13,16-17H,5-6,14-15H2,1-4H3/p+1
NCI pathway
Reactome pathway
n/an/a 81n/an/an/an/an/an/a
Parke-Davis Pharmaceutical Research
Assay Description
IC50 is the inhibitor concentration which inhibits 50% of kinase activity that catalyzes the transfer of the terminal phosphate from [gamma-32P] labe...
J Med Chem 41: 3276-92 (1998)
Article DOI: 10.1021/jm9802259
BindingDB Entry DOI: 10.7270/Q27P8WK3