null
SMILES: Cn1c2nc(Nc3ccc(OCCN4CCCCC4)cc3)ncc2cc(-c2c(Cl)cccc2Cl)c1=O
InChI Key: InChIKey=WQDGYGJFEUAXKW-UHFFFAOYSA-N
Activity Spreadsheet -- Enzyme Inhibition Constant Data from BindingDB
Found 3 hits for monomerid = 3100
Trg + Lig
Ki
nM
ΔG°
kcal/mole
IC50
nM
Kd
nM
EC50/IC50
nM
koff
s-1
kon
M-1s-1
pHTemp
°C
Platelet-derived growth factor receptor beta
(Homo sapiens (Human))
BDBM3100
(2-aminopyrido[2,3-d]pyrimidin-7(8H)-one 67 | 6-(2,...)
Show SMILES Cn1c2nc(Nc3ccc(OCCN4CCCCC4)cc3)ncc2cc(-c2c(Cl)cccc2Cl)c1=O |(-2.82,-1.97,;-2.82,-.43,;-4.15,.34,;-5.48,-.43,;-6.82,.34,;-8.15,-.43,;-8.15,-1.97,;-6.82,-2.74,;-6.82,-4.28,;-8.15,-5.05,;-8.15,-6.59,;-6.82,-7.36,;-5.48,-6.59,;-4.15,-7.36,;-4.19,-8.9,;-2.88,-9.71,;-1.53,-8.98,;-1.48,-7.44,;-2.79,-6.63,;-9.48,-4.28,;-9.48,-2.74,;-6.82,1.88,;-5.48,2.65,;-4.15,1.88,;-2.82,2.65,;-1.48,1.88,;-.15,2.65,;-.15,4.19,;-1.48,4.96,;1.18,4.96,;2.52,4.19,;2.52,2.65,;1.18,1.88,;1.18,.34,;-1.48,.34,;-.15,-.43,)|
Show InChI InChI=1S/C27H27Cl2N5O2/c1-33-25-18(16-21(26(33)35)24-22(28)6-5-7-23(24)29)17-30-27(32-25)31-19-8-10-20(11-9-19)36-15-14-34-12-3-2-4-13-34/h5-11,16-17H,2-4,12-15H2,1H3,(H,30,31,32)
NCI pathway
Reactome pathway
n/an/a 98n/an/an/an/an/an/a
Parke-Davis Pharmaceutical Research
Assay Description
IC50 is the inhibitor concentration which inhibits 50% of kinase activity that catalyzes the transfer of the terminal phosphate from [gamma-32P] labe...
J Med Chem 41: 3276-92 (1998)
Article DOI: 10.1021/jm9802259
BindingDB Entry DOI: 10.7270/Q27P8WK3
Proto-oncogene tyrosine-protein kinase Src
(Homo sapiens (Human))
BDBM3100
(2-aminopyrido[2,3-d]pyrimidin-7(8H)-one 67 | 6-(2,...)
Show SMILES Cn1c2nc(Nc3ccc(OCCN4CCCCC4)cc3)ncc2cc(-c2c(Cl)cccc2Cl)c1=O |(-2.82,-1.97,;-2.82,-.43,;-4.15,.34,;-5.48,-.43,;-6.82,.34,;-8.15,-.43,;-8.15,-1.97,;-6.82,-2.74,;-6.82,-4.28,;-8.15,-5.05,;-8.15,-6.59,;-6.82,-7.36,;-5.48,-6.59,;-4.15,-7.36,;-4.19,-8.9,;-2.88,-9.71,;-1.53,-8.98,;-1.48,-7.44,;-2.79,-6.63,;-9.48,-4.28,;-9.48,-2.74,;-6.82,1.88,;-5.48,2.65,;-4.15,1.88,;-2.82,2.65,;-1.48,1.88,;-.15,2.65,;-.15,4.19,;-1.48,4.96,;1.18,4.96,;2.52,4.19,;2.52,2.65,;1.18,1.88,;1.18,.34,;-1.48,.34,;-.15,-.43,)|
Show InChI InChI=1S/C27H27Cl2N5O2/c1-33-25-18(16-21(26(33)35)24-22(28)6-5-7-23(24)29)17-30-27(32-25)31-19-8-10-20(11-9-19)36-15-14-34-12-3-2-4-13-34/h5-11,16-17H,2-4,12-15H2,1H3,(H,30,31,32)
n/an/a 8n/an/an/an/an/an/a
Parke-Davis Pharmaceutical Research
Assay Description
IC50 is the inhibitor concentration which inhibits 50% of kinase activity that catalyzes the transfer of the terminal phosphate from [gamma-32P] labe...
J Med Chem 41: 3276-92 (1998)
Article DOI: 10.1021/jm9802259
BindingDB Entry DOI: 10.7270/Q27P8WK3
Fibroblast growth factor receptor 1
(Homo sapiens (Human))
BDBM3100
(2-aminopyrido[2,3-d]pyrimidin-7(8H)-one 67 | 6-(2,...)
Show SMILES Cn1c2nc(Nc3ccc(OCCN4CCCCC4)cc3)ncc2cc(-c2c(Cl)cccc2Cl)c1=O |(-2.82,-1.97,;-2.82,-.43,;-4.15,.34,;-5.48,-.43,;-6.82,.34,;-8.15,-.43,;-8.15,-1.97,;-6.82,-2.74,;-6.82,-4.28,;-8.15,-5.05,;-8.15,-6.59,;-6.82,-7.36,;-5.48,-6.59,;-4.15,-7.36,;-4.19,-8.9,;-2.88,-9.71,;-1.53,-8.98,;-1.48,-7.44,;-2.79,-6.63,;-9.48,-4.28,;-9.48,-2.74,;-6.82,1.88,;-5.48,2.65,;-4.15,1.88,;-2.82,2.65,;-1.48,1.88,;-.15,2.65,;-.15,4.19,;-1.48,4.96,;1.18,4.96,;2.52,4.19,;2.52,2.65,;1.18,1.88,;1.18,.34,;-1.48,.34,;-.15,-.43,)|
Show InChI InChI=1S/C27H27Cl2N5O2/c1-33-25-18(16-21(26(33)35)24-22(28)6-5-7-23(24)29)17-30-27(32-25)31-19-8-10-20(11-9-19)36-15-14-34-12-3-2-4-13-34/h5-11,16-17H,2-4,12-15H2,1H3,(H,30,31,32)
NCI pathway
Reactome pathway
n/an/a 39n/an/an/an/an/an/a
Parke-Davis Pharmaceutical Research
Assay Description
IC50 is the inhibitor concentration which inhibits 50% of kinase activity that catalyzes the transfer of the terminal phosphate from [gamma-32P] labe...
J Med Chem 41: 3276-92 (1998)
Article DOI: 10.1021/jm9802259
BindingDB Entry DOI: 10.7270/Q27P8WK3