null
SMILES: CN1C(C2=C(CCNC2=O)N(C1=O)c1cccc(c1)C(F)(F)F)c1ccc(cc1-c1cnco1)C#N
InChI Key: InChIKey=RQQUJWWBOXTPCP-UHFFFAOYSA-N
Activity Spreadsheet -- Enzyme Inhibition Constant Data from BindingDB
Found 2 hits for monomerid = 310062
Trg + Lig
Ki
nM
ΔG°
kcal/mole
IC50
nM
Kd
nM
EC50/IC50
nM
koff
s-1
kon
M-1s-1
pHTemp
°C
Neutrophil elastase
(Homo sapiens (Human))
BDBM310062
(US9657015, Example 25 | US9657015, Example 30A)
Show SMILES CN1C(C2=C(CCNC2=O)N(C1=O)c1cccc(c1)C(F)(F)F)c1ccc(cc1-c1cnco1)C#N |t:3|
Show InChI InChI=1S/C25H18F3N5O3/c1-32-22(17-6-5-14(11-29)9-18(17)20-12-30-13-36-20)21-19(7-8-31-23(21)34)33(24(32)35)16-4-2-3-15(10-16)25(26,27)28/h2-6,9-10,12-13,22H,7-8H2,1H3,(H,31,34)
Reactome pathway
US Patent
n/an/a<1n/an/an/an/an/an/a
Boehringer Ingelheim International GmbH
US Patent
Assay Description
Materials: Human neutrophil elastase was purchased from Calbiochem (Cat. No.: 324681) and the elastase substrate MeOSuc-Ala-Ala-Pro-Val-AMC from Bach...
US Patent US9657015 (2017)
BindingDB Entry DOI: 10.7270/Q28G8NRP
Neutrophil elastase
(Homo sapiens (Human))
BDBM310062
(US9657015, Example 25 | US9657015, Example 30A)
Show SMILES CN1C(C2=C(CCNC2=O)N(C1=O)c1cccc(c1)C(F)(F)F)c1ccc(cc1-c1cnco1)C#N |t:3|
Show InChI InChI=1S/C25H18F3N5O3/c1-32-22(17-6-5-14(11-29)9-18(17)20-12-30-13-36-20)21-19(7-8-31-23(21)34)33(24(32)35)16-4-2-3-15(10-16)25(26,27)28/h2-6,9-10,12-13,22H,7-8H2,1H3,(H,31,34)
Reactome pathway
US Patent
n/an/a<1n/an/an/an/an/an/a
Boehringer Ingelheim International GmbH
US Patent
Assay Description
Materials: Human neutrophil elastase was purchased from Calbiochem (Cat. No.: 324681) and the elastase substrate MeOSuc-Ala-Ala-Pro-Val-AMC from Bach...
US Patent US9657015 (2017)
BindingDB Entry DOI: 10.7270/Q28G8NRP