BDBM3101 2-aminopyrido[2,3-d]pyrimidin-7(8H)-one 68::6-(2,6-dichlorophenyl)-8-methyl-2-{[4-(4-methylpiperazin-1-yl)phenyl]amino}-7H,8H-pyrido[2,3-d]pyrimidin-7-one::CHEMBL51283::PD 166285 analog
SMILES: CN1CCN(CC1)c1ccc(Nc2ncc3cc(-c4c(Cl)cccc4Cl)c(=O)n(C)c3n2)cc1
InChI Key: InChIKey=PQCDARQYKPNDHN-UHFFFAOYSA-N
Data: 5 IC50
Activity Spreadsheet -- Enzyme Inhibition Constant Data from BindingDB
Found 5 hits for monomerid = 3101
Trg + Lig
Ki
nM
ΔG°
kcal/mole
IC50
nM
Kd
nM
EC50/IC50
nM
koff
s-1
kon
M-1s-1
pHTemp
°C
Platelet-derived growth factor receptor beta
(Homo sapiens (Human))
BDBM3101
(2-aminopyrido[2,3-d]pyrimidin-7(8H)-one 68 | 6-(2,...)
Show SMILES CN1CCN(CC1)c1ccc(Nc2ncc3cc(-c4c(Cl)cccc4Cl)c(=O)n(C)c3n2)cc1 |(-8.03,-11.21,;-8.03,-9.67,;-9.39,-8.95,;-9.45,-7.41,;-8.15,-6.59,;-6.79,-7.31,;-6.73,-8.85,;-8.15,-5.05,;-6.82,-4.28,;-6.82,-2.74,;-8.15,-1.97,;-8.15,-.43,;-6.82,.34,;-6.82,1.88,;-5.48,2.65,;-4.15,1.88,;-2.82,2.65,;-1.48,1.88,;-.15,2.65,;-.15,4.19,;-1.48,4.96,;1.18,4.96,;2.52,4.19,;2.52,2.65,;1.18,1.88,;1.18,.34,;-1.48,.34,;-.15,-.43,;-2.82,-.43,;-2.82,-1.97,;-4.15,.34,;-5.48,-.43,;-9.48,-2.74,;-9.48,-4.28,)|
Show InChI InChI=1S/C25H24Cl2N6O/c1-31-10-12-33(13-11-31)18-8-6-17(7-9-18)29-25-28-15-16-14-19(24(34)32(2)23(16)30-25)22-20(26)4-3-5-21(22)27/h3-9,14-15H,10-13H2,1-2H3,(H,28,29,30)
NCI pathway
Reactome pathway
n/an/a 110n/an/an/an/an/an/a
Parke-Davis Pharmaceutical Research
Assay Description
IC50 is the inhibitor concentration which inhibits 50% of kinase activity that catalyzes the transfer of the terminal phosphate from [gamma-32P] labe...
J Med Chem 41: 3276-92 (1998)
Article DOI: 10.1021/jm9802259
BindingDB Entry DOI: 10.7270/Q27P8WK3
Fibroblast growth factor receptor 1
(Homo sapiens (Human))
BDBM3101
(2-aminopyrido[2,3-d]pyrimidin-7(8H)-one 68 | 6-(2,...)
Show SMILES CN1CCN(CC1)c1ccc(Nc2ncc3cc(-c4c(Cl)cccc4Cl)c(=O)n(C)c3n2)cc1 |(-8.03,-11.21,;-8.03,-9.67,;-9.39,-8.95,;-9.45,-7.41,;-8.15,-6.59,;-6.79,-7.31,;-6.73,-8.85,;-8.15,-5.05,;-6.82,-4.28,;-6.82,-2.74,;-8.15,-1.97,;-8.15,-.43,;-6.82,.34,;-6.82,1.88,;-5.48,2.65,;-4.15,1.88,;-2.82,2.65,;-1.48,1.88,;-.15,2.65,;-.15,4.19,;-1.48,4.96,;1.18,4.96,;2.52,4.19,;2.52,2.65,;1.18,1.88,;1.18,.34,;-1.48,.34,;-.15,-.43,;-2.82,-.43,;-2.82,-1.97,;-4.15,.34,;-5.48,-.43,;-9.48,-2.74,;-9.48,-4.28,)|
Show InChI InChI=1S/C25H24Cl2N6O/c1-31-10-12-33(13-11-31)18-8-6-17(7-9-18)29-25-28-15-16-14-19(24(34)32(2)23(16)30-25)22-20(26)4-3-5-21(22)27/h3-9,14-15H,10-13H2,1-2H3,(H,28,29,30)
NCI pathway
Reactome pathway
n/an/a 28n/an/an/an/an/an/a
Parke-Davis Pharmaceutical Research
Assay Description
IC50 is the inhibitor concentration which inhibits 50% of kinase activity that catalyzes the transfer of the terminal phosphate from [gamma-32P] labe...
J Med Chem 41: 3276-92 (1998)
Article DOI: 10.1021/jm9802259
BindingDB Entry DOI: 10.7270/Q27P8WK3
PDGFR-beta/Platelet-derived growth factor receptor alpha
(Mus musculus (mouse))
BDBM3101
(2-aminopyrido[2,3-d]pyrimidin-7(8H)-one 68 | 6-(2,...)
Show SMILES CN1CCN(CC1)c1ccc(Nc2ncc3cc(-c4c(Cl)cccc4Cl)c(=O)n(C)c3n2)cc1 |(-8.03,-11.21,;-8.03,-9.67,;-9.39,-8.95,;-9.45,-7.41,;-8.15,-6.59,;-6.79,-7.31,;-6.73,-8.85,;-8.15,-5.05,;-6.82,-4.28,;-6.82,-2.74,;-8.15,-1.97,;-8.15,-.43,;-6.82,.34,;-6.82,1.88,;-5.48,2.65,;-4.15,1.88,;-2.82,2.65,;-1.48,1.88,;-.15,2.65,;-.15,4.19,;-1.48,4.96,;1.18,4.96,;2.52,4.19,;2.52,2.65,;1.18,1.88,;1.18,.34,;-1.48,.34,;-.15,-.43,;-2.82,-.43,;-2.82,-1.97,;-4.15,.34,;-5.48,-.43,;-9.48,-2.74,;-9.48,-4.28,)|
Show InChI InChI=1S/C25H24Cl2N6O/c1-31-10-12-33(13-11-31)18-8-6-17(7-9-18)29-25-28-15-16-14-19(24(34)32(2)23(16)30-25)22-20(26)4-3-5-21(22)27/h3-9,14-15H,10-13H2,1-2H3,(H,28,29,30)
n/an/a 115n/an/an/an/an/an/a
Warner-Lambert Company
Curated by ChEMBL
Assay Description
Inhibitory concentration of compound against mouse Platelet-derived growth factor receptor
J Med Chem 41: 1752-63 (1998)
Article DOI: 10.1021/jm970634p
BindingDB Entry DOI: 10.7270/Q26T0KQ6
Proto-oncogene tyrosine-protein kinase Src
(Gallus gallus (Chicken))
BDBM3101
(2-aminopyrido[2,3-d]pyrimidin-7(8H)-one 68 | 6-(2,...)
Show SMILES CN1CCN(CC1)c1ccc(Nc2ncc3cc(-c4c(Cl)cccc4Cl)c(=O)n(C)c3n2)cc1 |(-8.03,-11.21,;-8.03,-9.67,;-9.39,-8.95,;-9.45,-7.41,;-8.15,-6.59,;-6.79,-7.31,;-6.73,-8.85,;-8.15,-5.05,;-6.82,-4.28,;-6.82,-2.74,;-8.15,-1.97,;-8.15,-.43,;-6.82,.34,;-6.82,1.88,;-5.48,2.65,;-4.15,1.88,;-2.82,2.65,;-1.48,1.88,;-.15,2.65,;-.15,4.19,;-1.48,4.96,;1.18,4.96,;2.52,4.19,;2.52,2.65,;1.18,1.88,;1.18,.34,;-1.48,.34,;-.15,-.43,;-2.82,-.43,;-2.82,-1.97,;-4.15,.34,;-5.48,-.43,;-9.48,-2.74,;-9.48,-4.28,)|
Show InChI InChI=1S/C25H24Cl2N6O/c1-31-10-12-33(13-11-31)18-8-6-17(7-9-18)29-25-28-15-16-14-19(24(34)32(2)23(16)30-25)22-20(26)4-3-5-21(22)27/h3-9,14-15H,10-13H2,1-2H3,(H,28,29,30)
n/an/a 10n/an/an/an/an/an/a
Warner-Lambert Company
Curated by ChEMBL
Assay Description
Inhibition of chicken c-Src tyrosine kinase
J Med Chem 41: 1752-63 (1998)
Article DOI: 10.1021/jm970634p
BindingDB Entry DOI: 10.7270/Q26T0KQ6
Proto-oncogene tyrosine-protein kinase Src
(Homo sapiens (Human))
BDBM3101
(2-aminopyrido[2,3-d]pyrimidin-7(8H)-one 68 | 6-(2,...)
Show SMILES CN1CCN(CC1)c1ccc(Nc2ncc3cc(-c4c(Cl)cccc4Cl)c(=O)n(C)c3n2)cc1 |(-8.03,-11.21,;-8.03,-9.67,;-9.39,-8.95,;-9.45,-7.41,;-8.15,-6.59,;-6.79,-7.31,;-6.73,-8.85,;-8.15,-5.05,;-6.82,-4.28,;-6.82,-2.74,;-8.15,-1.97,;-8.15,-.43,;-6.82,.34,;-6.82,1.88,;-5.48,2.65,;-4.15,1.88,;-2.82,2.65,;-1.48,1.88,;-.15,2.65,;-.15,4.19,;-1.48,4.96,;1.18,4.96,;2.52,4.19,;2.52,2.65,;1.18,1.88,;1.18,.34,;-1.48,.34,;-.15,-.43,;-2.82,-.43,;-2.82,-1.97,;-4.15,.34,;-5.48,-.43,;-9.48,-2.74,;-9.48,-4.28,)|
Show InChI InChI=1S/C25H24Cl2N6O/c1-31-10-12-33(13-11-31)18-8-6-17(7-9-18)29-25-28-15-16-14-19(24(34)32(2)23(16)30-25)22-20(26)4-3-5-21(22)27/h3-9,14-15H,10-13H2,1-2H3,(H,28,29,30)
n/an/a 10n/an/an/an/an/an/a
Parke-Davis Pharmaceutical Research
Assay Description
IC50 is the inhibitor concentration which inhibits 50% of kinase activity that catalyzes the transfer of the terminal phosphate from [gamma-32P] labe...
J Med Chem 41: 3276-92 (1998)
Article DOI: 10.1021/jm9802259
BindingDB Entry DOI: 10.7270/Q27P8WK3