BDBM3104 2-(4-{[6-(2,6-dichlorophenyl)-8-methyl-7-oxo-7H,8H-pyrido[2,3-d]pyrimidin-2-yl]amino}phenyl)acetic acid::2-aminopyrido[2,3-d]pyrimidin-7(8H)-one 71::CHEMBL50647::PD 166285 analog
SMILES: Cn1c2nc(Nc3ccc(CC(O)=O)cc3)ncc2cc(-c2c(Cl)cccc2Cl)c1=O
InChI Key: InChIKey=AMKNQROTNAOJQE-UHFFFAOYSA-N
Data: 6 IC50
Activity Spreadsheet -- Enzyme Inhibition Constant Data from BindingDB
Found 6 hits for monomerid = 3104
Trg + Lig
Ki
nM
ΔG°
kcal/mole
IC50
nM
Kd
nM
EC50/IC50
nM
koff
s-1
kon
M-1s-1
pHTemp
°C
Platelet-derived growth factor receptor beta
(Homo sapiens (Human))
BDBM3104
(2-(4-{[6-(2,6-dichlorophenyl)-8-methyl-7-oxo-7H,8H...)
Show SMILES Cn1c2nc(Nc3ccc(CC(O)=O)cc3)ncc2cc(-c2c(Cl)cccc2Cl)c1=O |(-2.82,-1.97,;-2.82,-.43,;-4.15,.34,;-5.48,-.43,;-6.82,.34,;-8.15,-.43,;-8.15,-1.97,;-9.48,-2.74,;-9.48,-4.28,;-8.15,-5.05,;-8.15,-6.59,;-7.38,-7.93,;-5.84,-7.93,;-8.15,-9.26,;-6.82,-4.28,;-6.82,-2.74,;-6.82,1.88,;-5.48,2.65,;-4.15,1.88,;-2.82,2.65,;-1.48,1.88,;-.15,2.65,;-.15,4.19,;-1.48,4.96,;1.18,4.96,;2.52,4.19,;2.52,2.65,;1.18,1.88,;1.18,.34,;-1.48,.34,;-.15,-.43,)|
Show InChI InChI=1S/C22H16Cl2N4O3/c1-28-20-13(10-15(21(28)31)19-16(23)3-2-4-17(19)24)11-25-22(27-20)26-14-7-5-12(6-8-14)9-18(29)30/h2-8,10-11H,9H2,1H3,(H,29,30)(H,25,26,27)
NCI pathway
Reactome pathway
n/an/a 72n/an/an/an/an/an/a
Parke-Davis Pharmaceutical Research
Assay Description
IC50 is the inhibitor concentration which inhibits 50% of kinase activity that catalyzes the transfer of the terminal phosphate from [gamma-32P] labe...
J Med Chem 41: 3276-92 (1998)
Article DOI: 10.1021/jm9802259
BindingDB Entry DOI: 10.7270/Q27P8WK3
Fibroblast growth factor receptor 1
(Homo sapiens (Human))
BDBM3104
(2-(4-{[6-(2,6-dichlorophenyl)-8-methyl-7-oxo-7H,8H...)
Show SMILES Cn1c2nc(Nc3ccc(CC(O)=O)cc3)ncc2cc(-c2c(Cl)cccc2Cl)c1=O |(-2.82,-1.97,;-2.82,-.43,;-4.15,.34,;-5.48,-.43,;-6.82,.34,;-8.15,-.43,;-8.15,-1.97,;-9.48,-2.74,;-9.48,-4.28,;-8.15,-5.05,;-8.15,-6.59,;-7.38,-7.93,;-5.84,-7.93,;-8.15,-9.26,;-6.82,-4.28,;-6.82,-2.74,;-6.82,1.88,;-5.48,2.65,;-4.15,1.88,;-2.82,2.65,;-1.48,1.88,;-.15,2.65,;-.15,4.19,;-1.48,4.96,;1.18,4.96,;2.52,4.19,;2.52,2.65,;1.18,1.88,;1.18,.34,;-1.48,.34,;-.15,-.43,)|
Show InChI InChI=1S/C22H16Cl2N4O3/c1-28-20-13(10-15(21(28)31)19-16(23)3-2-4-17(19)24)11-25-22(27-20)26-14-7-5-12(6-8-14)9-18(29)30/h2-8,10-11H,9H2,1H3,(H,29,30)(H,25,26,27)
NCI pathway
Reactome pathway
n/an/a 61n/an/an/an/an/an/a
Parke-Davis Pharmaceutical Research
Assay Description
IC50 is the inhibitor concentration which inhibits 50% of kinase activity that catalyzes the transfer of the terminal phosphate from [gamma-32P] labe...
J Med Chem 41: 3276-92 (1998)
Article DOI: 10.1021/jm9802259
BindingDB Entry DOI: 10.7270/Q27P8WK3
PDGFR-beta/Platelet-derived growth factor receptor alpha
(Mus musculus (mouse))
BDBM3104
(2-(4-{[6-(2,6-dichlorophenyl)-8-methyl-7-oxo-7H,8H...)
Show SMILES Cn1c2nc(Nc3ccc(CC(O)=O)cc3)ncc2cc(-c2c(Cl)cccc2Cl)c1=O |(-2.82,-1.97,;-2.82,-.43,;-4.15,.34,;-5.48,-.43,;-6.82,.34,;-8.15,-.43,;-8.15,-1.97,;-9.48,-2.74,;-9.48,-4.28,;-8.15,-5.05,;-8.15,-6.59,;-7.38,-7.93,;-5.84,-7.93,;-8.15,-9.26,;-6.82,-4.28,;-6.82,-2.74,;-6.82,1.88,;-5.48,2.65,;-4.15,1.88,;-2.82,2.65,;-1.48,1.88,;-.15,2.65,;-.15,4.19,;-1.48,4.96,;1.18,4.96,;2.52,4.19,;2.52,2.65,;1.18,1.88,;1.18,.34,;-1.48,.34,;-.15,-.43,)|
Show InChI InChI=1S/C22H16Cl2N4O3/c1-28-20-13(10-15(21(28)31)19-16(23)3-2-4-17(19)24)11-25-22(27-20)26-14-7-5-12(6-8-14)9-18(29)30/h2-8,10-11H,9H2,1H3,(H,29,30)(H,25,26,27)
n/an/a 70n/an/an/an/an/an/a
Warner-Lambert Company
Curated by ChEMBL
Assay Description
Inhibitory concentration of compound against mouse Platelet-derived growth factor receptor
J Med Chem 41: 1752-63 (1998)
Article DOI: 10.1021/jm970634p
BindingDB Entry DOI: 10.7270/Q26T0KQ6
Epidermal growth factor receptor
(Homo sapiens (Human))
BDBM3104
(2-(4-{[6-(2,6-dichlorophenyl)-8-methyl-7-oxo-7H,8H...)
Show SMILES Cn1c2nc(Nc3ccc(CC(O)=O)cc3)ncc2cc(-c2c(Cl)cccc2Cl)c1=O |(-2.82,-1.97,;-2.82,-.43,;-4.15,.34,;-5.48,-.43,;-6.82,.34,;-8.15,-.43,;-8.15,-1.97,;-9.48,-2.74,;-9.48,-4.28,;-8.15,-5.05,;-8.15,-6.59,;-7.38,-7.93,;-5.84,-7.93,;-8.15,-9.26,;-6.82,-4.28,;-6.82,-2.74,;-6.82,1.88,;-5.48,2.65,;-4.15,1.88,;-2.82,2.65,;-1.48,1.88,;-.15,2.65,;-.15,4.19,;-1.48,4.96,;1.18,4.96,;2.52,4.19,;2.52,2.65,;1.18,1.88,;1.18,.34,;-1.48,.34,;-.15,-.43,)|
Show InChI InChI=1S/C22H16Cl2N4O3/c1-28-20-13(10-15(21(28)31)19-16(23)3-2-4-17(19)24)11-25-22(27-20)26-14-7-5-12(6-8-14)9-18(29)30/h2-8,10-11H,9H2,1H3,(H,29,30)(H,25,26,27)
n/an/a 220n/an/an/an/an/an/a
Parke-Davis Pharmaceutical Research
Assay Description
IC50 is the inhibitor concentration which inhibits 50% of kinase activity that catalyzes the transfer of the terminal phosphate from [gamma-32P] labe...
J Med Chem 41: 3276-92 (1998)
Article DOI: 10.1021/jm9802259
BindingDB Entry DOI: 10.7270/Q27P8WK3
Proto-oncogene tyrosine-protein kinase Src
(Gallus gallus (Chicken))
BDBM3104
(2-(4-{[6-(2,6-dichlorophenyl)-8-methyl-7-oxo-7H,8H...)
Show SMILES Cn1c2nc(Nc3ccc(CC(O)=O)cc3)ncc2cc(-c2c(Cl)cccc2Cl)c1=O |(-2.82,-1.97,;-2.82,-.43,;-4.15,.34,;-5.48,-.43,;-6.82,.34,;-8.15,-.43,;-8.15,-1.97,;-9.48,-2.74,;-9.48,-4.28,;-8.15,-5.05,;-8.15,-6.59,;-7.38,-7.93,;-5.84,-7.93,;-8.15,-9.26,;-6.82,-4.28,;-6.82,-2.74,;-6.82,1.88,;-5.48,2.65,;-4.15,1.88,;-2.82,2.65,;-1.48,1.88,;-.15,2.65,;-.15,4.19,;-1.48,4.96,;1.18,4.96,;2.52,4.19,;2.52,2.65,;1.18,1.88,;1.18,.34,;-1.48,.34,;-.15,-.43,)|
Show InChI InChI=1S/C22H16Cl2N4O3/c1-28-20-13(10-15(21(28)31)19-16(23)3-2-4-17(19)24)11-25-22(27-20)26-14-7-5-12(6-8-14)9-18(29)30/h2-8,10-11H,9H2,1H3,(H,29,30)(H,25,26,27)
n/an/a 10n/an/an/an/an/an/a
Warner-Lambert Company
Curated by ChEMBL
Assay Description
Inhibition of chicken c-Src tyrosine kinase
J Med Chem 41: 1752-63 (1998)
Article DOI: 10.1021/jm970634p
BindingDB Entry DOI: 10.7270/Q26T0KQ6
Proto-oncogene tyrosine-protein kinase Src
(Homo sapiens (Human))
BDBM3104
(2-(4-{[6-(2,6-dichlorophenyl)-8-methyl-7-oxo-7H,8H...)
Show SMILES Cn1c2nc(Nc3ccc(CC(O)=O)cc3)ncc2cc(-c2c(Cl)cccc2Cl)c1=O |(-2.82,-1.97,;-2.82,-.43,;-4.15,.34,;-5.48,-.43,;-6.82,.34,;-8.15,-.43,;-8.15,-1.97,;-9.48,-2.74,;-9.48,-4.28,;-8.15,-5.05,;-8.15,-6.59,;-7.38,-7.93,;-5.84,-7.93,;-8.15,-9.26,;-6.82,-4.28,;-6.82,-2.74,;-6.82,1.88,;-5.48,2.65,;-4.15,1.88,;-2.82,2.65,;-1.48,1.88,;-.15,2.65,;-.15,4.19,;-1.48,4.96,;1.18,4.96,;2.52,4.19,;2.52,2.65,;1.18,1.88,;1.18,.34,;-1.48,.34,;-.15,-.43,)|
Show InChI InChI=1S/C22H16Cl2N4O3/c1-28-20-13(10-15(21(28)31)19-16(23)3-2-4-17(19)24)11-25-22(27-20)26-14-7-5-12(6-8-14)9-18(29)30/h2-8,10-11H,9H2,1H3,(H,29,30)(H,25,26,27)
n/an/a 10n/an/an/an/an/an/a
Parke-Davis Pharmaceutical Research
Assay Description
IC50 is the inhibitor concentration which inhibits 50% of kinase activity that catalyzes the transfer of the terminal phosphate from [gamma-32P] labe...
J Med Chem 41: 3276-92 (1998)
Article DOI: 10.1021/jm9802259
BindingDB Entry DOI: 10.7270/Q27P8WK3