null
SMILES: Cc1noc(n1)N(CCCCCCCC(=O)NO)c1ccc(F)cn1
InChI Key: InChIKey=DJNFAOJJLHYPLD-UHFFFAOYSA-N
Activity Spreadsheet -- Enzyme Inhibition Constant Data from BindingDB
Found 2 hits for monomerid = 310718
Trg + Lig
Ki
nM
ΔG°
kcal/mole
IC50
nM
Kd
nM
EC50/IC50
nM
koff
s-1
kon
M-1s-1
pHTemp
°C
Histone deacetylase 6
(Homo sapiens (Human))
BDBM310718
(8-((5-Fluoropyridin-2-yl)(3-methyl-1,2,4-oxadiazol...)
Show SMILES Cc1noc(n1)N(CCCCCCCC(=O)NO)c1ccc(F)cn1
Show InChI InChI=1S/C16H22FN5O3/c1-12-19-16(25-21-12)22(14-9-8-13(17)11-18-14)10-6-4-2-3-5-7-15(23)20-24/h8-9,11,24H,2-7,10H2,1H3,(H,20,23)
NCI pathway
Reactome pathway
US Patent
n/an/a<500n/an/an/an/an/an/a
Karus Therapeutics Limited
US Patent
Assay Description
The assay is described in WO2008/062201.
US Patent US10150763 (2018)
BindingDB Entry DOI: 10.7270/Q2C82CC1
Histone deacetylase 1
(Homo sapiens (Human))
BDBM310718
(8-((5-Fluoropyridin-2-yl)(3-methyl-1,2,4-oxadiazol...)
Show SMILES Cc1noc(n1)N(CCCCCCCC(=O)NO)c1ccc(F)cn1
Show InChI InChI=1S/C16H22FN5O3/c1-12-19-16(25-21-12)22(14-9-8-13(17)11-18-14)10-6-4-2-3-5-7-15(23)20-24/h8-9,11,24H,2-7,10H2,1H3,(H,20,23)
NCI pathway
Reactome pathway
US Patent
n/an/a 5.50E+3n/an/an/an/an/an/a
Karus Therapeutics Limited
US Patent
Assay Description
The assay is described in WO2008/062201.
US Patent US10150763 (2018)
BindingDB Entry DOI: 10.7270/Q2C82CC1