BDBM311193 (S)-1-(2-(difluoromethyl)-4-(2-(difluoromethyl)pyridin-4-yl)phenoxy)-2,4-dimethylpentan-2-amine::US10155760, Example 37::US10351563, Example 37::US10544120, Example 37::US10723734, Example 37::US10981910, Example 37::US9902722, Example 37
SMILES: CC(C)C[C@](C)(N)COc1ccc(cc1C(F)F)-c1ccnc(c1)C(F)F
InChI Key: InChIKey=NGBWQVJCOYTGOR-FQEVSTJZSA-N
Data: 6 IC50
Activity Spreadsheet -- Enzyme Inhibition Constant Data from BindingDB
Found 6 hits for monomerid = 311193
Trg + Lig
Ki
nM
ΔG°
kcal/mole
IC50
nM
Kd
nM
EC50/IC50
nM
koff
s-1
kon
M-1s-1
pHTemp
°C
AP2-associated protein kinase 1
(Homo sapiens (Human))
BDBM311193
((S)-1-(2-(difluoromethyl)-4-(2-(difluoromethyl)pyr...)
Show SMILES CC(C)C[C@](C)(N)COc1ccc(cc1C(F)F)-c1ccnc(c1)C(F)F |r|
Show InChI InChI=1S/C20H24F4N2O/c1-12(2)10-20(3,25)11-27-17-5-4-13(8-15(17)18(21)22)14-6-7-26-16(9-14)19(23)24/h4-9,12,18-19H,10-11,25H2,1-3H3/t20-/m0/s1
US Patent
n/an/a 0.510n/an/an/an/an/an/a
Bristol-Myers Squibb Company
US Patent
Assay Description
The assays were performed in U-bottom 384-well plates. The final assay volume was 30 μl prepared from 15 μl additions of enzyme and substra...
US Patent US10155760 (2018)
BindingDB Entry DOI: 10.7270/Q2F191S4
AP2-associated protein kinase 1
(Homo sapiens (Human))
BDBM311193
((S)-1-(2-(difluoromethyl)-4-(2-(difluoromethyl)pyr...)
Show SMILES CC(C)C[C@](C)(N)COc1ccc(cc1C(F)F)-c1ccnc(c1)C(F)F |r|
Show InChI InChI=1S/C20H24F4N2O/c1-12(2)10-20(3,25)11-27-17-5-4-13(8-15(17)18(21)22)14-6-7-26-16(9-14)19(23)24/h4-9,12,18-19H,10-11,25H2,1-3H3/t20-/m0/s1
US Patent
n/an/a 0.510n/an/an/an/an/an/a
University of Mississippi
Assay Description
The assays were performed in U-bottom 384-well plates. The final assay volume was 30 μl prepared from 15 μl additions of enzyme and substra...
J Med Chem 48: 2906-15 (2005)
BindingDB Entry DOI: 10.7270/Q2930WGG
AP2-associated protein kinase 1
(Homo sapiens (Human))
BDBM311193
((S)-1-(2-(difluoromethyl)-4-(2-(difluoromethyl)pyr...)
Show SMILES CC(C)C[C@](C)(N)COc1ccc(cc1C(F)F)-c1ccnc(c1)C(F)F |r|
Show InChI InChI=1S/C20H24F4N2O/c1-12(2)10-20(3,25)11-27-17-5-4-13(8-15(17)18(21)22)14-6-7-26-16(9-14)19(23)24/h4-9,12,18-19H,10-11,25H2,1-3H3/t20-/m0/s1
US Patent
n/an/a 0.510n/an/an/an/an/an/a
Bristol-Myers Squibb Company
US Patent
Assay Description
The assays were performed in U-bottom 384-well plates. The final assay volume was 30 μl prepared from 15 μl additions of enzyme and substra...
US Patent US10981910 (2021)
AP2-associated protein kinase 1
(Homo sapiens (Human))
BDBM311193
((S)-1-(2-(difluoromethyl)-4-(2-(difluoromethyl)pyr...)
Show SMILES CC(C)C[C@](C)(N)COc1ccc(cc1C(F)F)-c1ccnc(c1)C(F)F |r|
Show InChI InChI=1S/C20H24F4N2O/c1-12(2)10-20(3,25)11-27-17-5-4-13(8-15(17)18(21)22)14-6-7-26-16(9-14)19(23)24/h4-9,12,18-19H,10-11,25H2,1-3H3/t20-/m0/s1
US Patent
n/an/a 0.510n/an/an/an/an/an/a
Bristol-Myers Squibb Company
US Patent
Assay Description
The assays were performed in U-bottom 384-well plates. The final assay volume was 30 μl prepared from 15 μl additions of enzyme and substra...
US Patent US10544120 (2020)
BindingDB Entry DOI: 10.7270/Q2RF5XCX
AP2-associated protein kinase 1
(Homo sapiens (Human))
BDBM311193
((S)-1-(2-(difluoromethyl)-4-(2-(difluoromethyl)pyr...)
Show SMILES CC(C)C[C@](C)(N)COc1ccc(cc1C(F)F)-c1ccnc(c1)C(F)F |r|
Show InChI InChI=1S/C20H24F4N2O/c1-12(2)10-20(3,25)11-27-17-5-4-13(8-15(17)18(21)22)14-6-7-26-16(9-14)19(23)24/h4-9,12,18-19H,10-11,25H2,1-3H3/t20-/m0/s1
US Patent
n/an/a 0.510n/an/an/an/an/an/a
Bristol-Myers Squibb Company
US Patent
Assay Description
The assays were performed in U-bottom 384-well plates. The final assay volume was 30 Cl prepared from 15 μl additions of enzyme and substrates (...
US Patent US10723734 (2020)
AP2-associated protein kinase 1
(Homo sapiens (Human))
BDBM311193
((S)-1-(2-(difluoromethyl)-4-(2-(difluoromethyl)pyr...)
Show SMILES CC(C)C[C@](C)(N)COc1ccc(cc1C(F)F)-c1ccnc(c1)C(F)F |r|
Show InChI InChI=1S/C20H24F4N2O/c1-12(2)10-20(3,25)11-27-17-5-4-13(8-15(17)18(21)22)14-6-7-26-16(9-14)19(23)24/h4-9,12,18-19H,10-11,25H2,1-3H3/t20-/m0/s1
US Patent
n/an/a 0.510n/an/an/an/an/an/a
Bristol-Myers Squibb Co.
US Patent
Assay Description
The assays were performed in U-bottom 384-well plates. The final assay volume was 30 μl prepared from 15 μl additions of enzyme and substra...
US Patent US10351563 (2019)
BindingDB Entry DOI: 10.7270/Q2P55QWS