BDBM311199 (S)-2,4-dimethyl-1-(4-(pyridin-4-yl)-2-(trifluoromethyl)phenoxy)pentan-2-amine::US10155760, Example 43::US10351563, Example 43::US10544120, Example 43::US10723734, Example 43::US10981910, Example 43::US9902722, Example 43
SMILES: CC(C)C[C@](C)(N)COc1ccc(cc1C(F)(F)F)-c1ccncc1
InChI Key: InChIKey=UJFBQMHGCCSHRP-SFHVURJKSA-N
Data: 6 IC50
Activity Spreadsheet -- Enzyme Inhibition Constant Data from BindingDB
Found 6 hits for monomerid = 311199
Trg + Lig
Ki
nM
ΔG°
kcal/mole
IC50
nM
Kd
nM
EC50/IC50
nM
koff
s-1
kon
M-1s-1
pHTemp
°C
AP2-associated protein kinase 1
(Homo sapiens (Human))
BDBM311199
((S)-2,4-dimethyl-1-(4-(pyridin-4-yl)-2-(trifluorom...)
Show SMILES CC(C)C[C@](C)(N)COc1ccc(cc1C(F)(F)F)-c1ccncc1 |r|
Show InChI InChI=1S/C19H23F3N2O/c1-13(2)11-18(3,23)12-25-17-5-4-15(10-16(17)19(20,21)22)14-6-8-24-9-7-14/h4-10,13H,11-12,23H2,1-3H3/t18-/m0/s1
US Patent
n/an/a 0.640n/an/an/an/an/an/a
Bristol-Myers Squibb Company
US Patent
Assay Description
The assays were performed in U-bottom 384-well plates. The final assay volume was 30 μl prepared from 15 μl additions of enzyme and substra...
US Patent US10155760 (2018)
BindingDB Entry DOI: 10.7270/Q2F191S4
AP2-associated protein kinase 1
(Homo sapiens (Human))
BDBM311199
((S)-2,4-dimethyl-1-(4-(pyridin-4-yl)-2-(trifluorom...)
Show SMILES CC(C)C[C@](C)(N)COc1ccc(cc1C(F)(F)F)-c1ccncc1 |r|
Show InChI InChI=1S/C19H23F3N2O/c1-13(2)11-18(3,23)12-25-17-5-4-15(10-16(17)19(20,21)22)14-6-8-24-9-7-14/h4-10,13H,11-12,23H2,1-3H3/t18-/m0/s1
US Patent
n/an/a 0.640n/an/an/an/an/an/a
University of Mississippi
Assay Description
The assays were performed in U-bottom 384-well plates. The final assay volume was 30 μl prepared from 15 μl additions of enzyme and substra...
J Med Chem 48: 2906-15 (2005)
BindingDB Entry DOI: 10.7270/Q2930WGG
AP2-associated protein kinase 1
(Homo sapiens (Human))
BDBM311199
((S)-2,4-dimethyl-1-(4-(pyridin-4-yl)-2-(trifluorom...)
Show SMILES CC(C)C[C@](C)(N)COc1ccc(cc1C(F)(F)F)-c1ccncc1 |r|
Show InChI InChI=1S/C19H23F3N2O/c1-13(2)11-18(3,23)12-25-17-5-4-15(10-16(17)19(20,21)22)14-6-8-24-9-7-14/h4-10,13H,11-12,23H2,1-3H3/t18-/m0/s1
US Patent
n/an/a 0.640n/an/an/an/an/an/a
Bristol-Myers Squibb Company
US Patent
Assay Description
The assays were performed in U-bottom 384-well plates. The final assay volume was 30 μl prepared from 15 μl additions of enzyme and substra...
US Patent US10981910 (2021)
AP2-associated protein kinase 1
(Homo sapiens (Human))
BDBM311199
((S)-2,4-dimethyl-1-(4-(pyridin-4-yl)-2-(trifluorom...)
Show SMILES CC(C)C[C@](C)(N)COc1ccc(cc1C(F)(F)F)-c1ccncc1 |r|
Show InChI InChI=1S/C19H23F3N2O/c1-13(2)11-18(3,23)12-25-17-5-4-15(10-16(17)19(20,21)22)14-6-8-24-9-7-14/h4-10,13H,11-12,23H2,1-3H3/t18-/m0/s1
US Patent
n/an/a 0.640n/an/an/an/an/an/a
Bristol-Myers Squibb Company
US Patent
Assay Description
The assays were performed in U-bottom 384-well plates. The final assay volume was 30 μl prepared from 15 μl additions of enzyme and substra...
US Patent US10544120 (2020)
BindingDB Entry DOI: 10.7270/Q2RF5XCX
AP2-associated protein kinase 1
(Homo sapiens (Human))
BDBM311199
((S)-2,4-dimethyl-1-(4-(pyridin-4-yl)-2-(trifluorom...)
Show SMILES CC(C)C[C@](C)(N)COc1ccc(cc1C(F)(F)F)-c1ccncc1 |r|
Show InChI InChI=1S/C19H23F3N2O/c1-13(2)11-18(3,23)12-25-17-5-4-15(10-16(17)19(20,21)22)14-6-8-24-9-7-14/h4-10,13H,11-12,23H2,1-3H3/t18-/m0/s1
US Patent
n/an/a 0.640n/an/an/an/an/an/a
Bristol-Myers Squibb Company
US Patent
Assay Description
The assays were performed in U-bottom 384-well plates. The final assay volume was 30 Cl prepared from 15 μl additions of enzyme and substrates (...
US Patent US10723734 (2020)
AP2-associated protein kinase 1
(Homo sapiens (Human))
BDBM311199
((S)-2,4-dimethyl-1-(4-(pyridin-4-yl)-2-(trifluorom...)
Show SMILES CC(C)C[C@](C)(N)COc1ccc(cc1C(F)(F)F)-c1ccncc1 |r|
Show InChI InChI=1S/C19H23F3N2O/c1-13(2)11-18(3,23)12-25-17-5-4-15(10-16(17)19(20,21)22)14-6-8-24-9-7-14/h4-10,13H,11-12,23H2,1-3H3/t18-/m0/s1
US Patent
n/an/a 0.640n/an/an/an/an/an/a
Bristol-Myers Squibb Co.
US Patent
Assay Description
The assays were performed in U-bottom 384-well plates. The final assay volume was 30 μl prepared from 15 μl additions of enzyme and substra...
US Patent US10351563 (2019)
BindingDB Entry DOI: 10.7270/Q2P55QWS