BDBM311339 (S)-methyl (6-((2-amino-2,4-dimethylpentyl)oxy)-5-(difluoromethyl)-[3,4′-bipyridin]-2′-yl)carbamate::US10155760, Example 196::US10351563, Example 196::US10544120, Example 196::US10723734, Example 196::US10981910, Example 196::US9902722, Example 196
SMILES: COC(=O)Nc1cc(ccn1)-c1cnc(OC[C@@](C)(N)CC(C)C)c(c1)C(F)F
InChI Key: InChIKey=LYPCNZGCERKJEG-FQEVSTJZSA-N
Data: 6 IC50
Activity Spreadsheet -- Enzyme Inhibition Constant Data from BindingDB
Found 6 hits for monomerid = 311339
Trg + Lig
Ki
nM
ΔG°
kcal/mole
IC50
nM
Kd
nM
EC50/IC50
nM
koff
s-1
kon
M-1s-1
pHTemp
°C
AP2-associated protein kinase 1
(Homo sapiens (Human))
BDBM311339
((S)-methyl (6-((2-amino-2,4-dimethylpentyl)oxy)-5-...)
Show SMILES COC(=O)Nc1cc(ccn1)-c1cnc(OC[C@@](C)(N)CC(C)C)c(c1)C(F)F |r|
Show InChI InChI=1S/C20H26F2N4O3/c1-12(2)9-20(3,23)11-29-18-15(17(21)22)7-14(10-25-18)13-5-6-24-16(8-13)26-19(27)28-4/h5-8,10,12,17H,9,11,23H2,1-4H3,(H,24,26,27)/t20-/m0/s1
US Patent
n/an/a 0.200n/an/an/an/an/an/a
Bristol-Myers Squibb Company
US Patent
Assay Description
The assays were performed in U-bottom 384-well plates. The final assay volume was 30 μl prepared from 15 μl additions of enzyme and substra...
US Patent US10155760 (2018)
BindingDB Entry DOI: 10.7270/Q2F191S4
AP2-associated protein kinase 1
(Homo sapiens (Human))
BDBM311339
((S)-methyl (6-((2-amino-2,4-dimethylpentyl)oxy)-5-...)
Show SMILES COC(=O)Nc1cc(ccn1)-c1cnc(OC[C@@](C)(N)CC(C)C)c(c1)C(F)F |r|
Show InChI InChI=1S/C20H26F2N4O3/c1-12(2)9-20(3,23)11-29-18-15(17(21)22)7-14(10-25-18)13-5-6-24-16(8-13)26-19(27)28-4/h5-8,10,12,17H,9,11,23H2,1-4H3,(H,24,26,27)/t20-/m0/s1
US Patent
n/an/a 0.200n/an/an/an/an/an/a
University of Mississippi
Assay Description
The assays were performed in U-bottom 384-well plates. The final assay volume was 30 μl prepared from 15 μl additions of enzyme and substra...
J Med Chem 48: 2906-15 (2005)
BindingDB Entry DOI: 10.7270/Q2930WGG
AP2-associated protein kinase 1
(Homo sapiens (Human))
BDBM311339
((S)-methyl (6-((2-amino-2,4-dimethylpentyl)oxy)-5-...)
Show SMILES COC(=O)Nc1cc(ccn1)-c1cnc(OC[C@@](C)(N)CC(C)C)c(c1)C(F)F |r|
Show InChI InChI=1S/C20H26F2N4O3/c1-12(2)9-20(3,23)11-29-18-15(17(21)22)7-14(10-25-18)13-5-6-24-16(8-13)26-19(27)28-4/h5-8,10,12,17H,9,11,23H2,1-4H3,(H,24,26,27)/t20-/m0/s1
US Patent
n/an/a 0.200n/an/an/an/an/an/a
Bristol-Myers Squibb Company
US Patent
Assay Description
The assays were performed in U-bottom 384-well plates. The final assay volume was 30 μl prepared from 15 μl additions of enzyme and substra...
US Patent US10981910 (2021)
AP2-associated protein kinase 1
(Homo sapiens (Human))
BDBM311339
((S)-methyl (6-((2-amino-2,4-dimethylpentyl)oxy)-5-...)
Show SMILES COC(=O)Nc1cc(ccn1)-c1cnc(OC[C@@](C)(N)CC(C)C)c(c1)C(F)F |r|
Show InChI InChI=1S/C20H26F2N4O3/c1-12(2)9-20(3,23)11-29-18-15(17(21)22)7-14(10-25-18)13-5-6-24-16(8-13)26-19(27)28-4/h5-8,10,12,17H,9,11,23H2,1-4H3,(H,24,26,27)/t20-/m0/s1
US Patent
n/an/a 0.200n/an/an/an/an/an/a
Bristol-Myers Squibb Company
US Patent
Assay Description
The assays were performed in U-bottom 384-well plates. The final assay volume was 30 μl prepared from 15 μl additions of enzyme and substra...
US Patent US10544120 (2020)
BindingDB Entry DOI: 10.7270/Q2RF5XCX
AP2-associated protein kinase 1
(Homo sapiens (Human))
BDBM311339
((S)-methyl (6-((2-amino-2,4-dimethylpentyl)oxy)-5-...)
Show SMILES COC(=O)Nc1cc(ccn1)-c1cnc(OC[C@@](C)(N)CC(C)C)c(c1)C(F)F |r|
Show InChI InChI=1S/C20H26F2N4O3/c1-12(2)9-20(3,23)11-29-18-15(17(21)22)7-14(10-25-18)13-5-6-24-16(8-13)26-19(27)28-4/h5-8,10,12,17H,9,11,23H2,1-4H3,(H,24,26,27)/t20-/m0/s1
US Patent
n/an/a 0.200n/an/an/an/an/an/a
Bristol-Myers Squibb Company
US Patent
Assay Description
The assays were performed in U-bottom 384-well plates. The final assay volume was 30 Cl prepared from 15 μl additions of enzyme and substrates (...
US Patent US10723734 (2020)
AP2-associated protein kinase 1
(Homo sapiens (Human))
BDBM311339
((S)-methyl (6-((2-amino-2,4-dimethylpentyl)oxy)-5-...)
Show SMILES COC(=O)Nc1cc(ccn1)-c1cnc(OC[C@@](C)(N)CC(C)C)c(c1)C(F)F |r|
Show InChI InChI=1S/C20H26F2N4O3/c1-12(2)9-20(3,23)11-29-18-15(17(21)22)7-14(10-25-18)13-5-6-24-16(8-13)26-19(27)28-4/h5-8,10,12,17H,9,11,23H2,1-4H3,(H,24,26,27)/t20-/m0/s1
US Patent
n/an/a 0.200n/an/an/an/an/an/a
Bristol-Myers Squibb Co.
US Patent
Assay Description
The assays were performed in U-bottom 384-well plates. The final assay volume was 30 μl prepared from 15 μl additions of enzyme and substra...
US Patent US10351563 (2019)
BindingDB Entry DOI: 10.7270/Q2P55QWS