BDBM311439 CHEM-US-00136::US10155764, Example 27
SMILES: CN(C)C(CNc1nn(C)c(=O)c2ccccc12)c1ccc(Cl)cc1
InChI Key: InChIKey=MWIWHWXVLBRFTA-UHFFFAOYSA-N
Data: 1 IC50
Activity Spreadsheet -- Enzyme Inhibition Constant Data from BindingDB
Found 1 hit for monomerid = 311439
Trg + Lig
Ki
nM
ΔG°
kcal/mole
IC50
nM
Kd
nM
EC50/IC50
nM
koff
s-1
kon
M-1s-1
pHTemp
°C
Histone acetyltransferase KAT2B [719-832]
(Homo sapiens (Human))
BDBM311439
(CHEM-US-00136 | US10155764, Example 27)
Show SMILES CN(C)C(CNc1nn(C)c(=O)c2ccccc12)c1ccc(Cl)cc1
Show InChI InChI=1S/C19H21ClN4O/c1-23(2)17(13-8-10-14(20)11-9-13)12-21-18-15-6-4-5-7-16(15)19(25)24(3)22-18/h4-11,17H,12H2,1-3H3,(H,21,22)
NCI pathway
Reactome pathway
US Patent
n/an/a 120n/an/an/an/an/an/a
GENENTECH, INC; CONSTELLATION PHARMACEUTICALS, INC.
US Patent
Assay Description
His/Flag epitope tagged PCAF719-832 bromodomain was cloned, expressed and purified to homogeneity in-house. PCAF bromodomain binding and inhibition o...
US Patent US10155764 (2018)
BindingDB Entry DOI: 10.7270/Q25M67T9