BDBM311479 CHEM-US-00185::US10155764, Example 59
SMILES: CC(C)Oc1ccc(cc1)[C@@H]([C@H](C)Nc1nn(C)c(=O)c2ccccc12)N(C)C
InChI Key: InChIKey=NXELOJVKZKLRRJ-HRAATJIYSA-N
Data: 1 IC50
Activity Spreadsheet -- Enzyme Inhibition Constant Data from BindingDB
Found 1 hit for monomerid = 311479
Trg + Lig
Ki
nM
ΔG°
kcal/mole
IC50
nM
Kd
nM
EC50/IC50
nM
koff
s-1
kon
M-1s-1
pHTemp
°C
Histone acetyltransferase KAT2B [719-832]
(Homo sapiens (Human))
BDBM311479
(CHEM-US-00185 | US10155764, Example 59)
Show SMILES CC(C)Oc1ccc(cc1)[C@@H]([C@H](C)Nc1nn(C)c(=O)c2ccccc12)N(C)C |r|
Show InChI InChI=1S/C23H30N4O2/c1-15(2)29-18-13-11-17(12-14-18)21(26(4)5)16(3)24-22-19-9-7-8-10-20(19)23(28)27(6)25-22/h7-16,21H,1-6H3,(H,24,25)/t16-,21+/m0/s1
NCI pathway
Reactome pathway
US Patent
n/an/a 33n/an/an/an/an/an/a
GENENTECH, INC; CONSTELLATION PHARMACEUTICALS, INC.
US Patent
Assay Description
His/Flag epitope tagged PCAF719-832 bromodomain was cloned, expressed and purified to homogeneity in-house. PCAF bromodomain binding and inhibition o...
US Patent US10155764 (2018)
BindingDB Entry DOI: 10.7270/Q25M67T9