BDBM311510 CHEM-US-00230::US10155764, Example 85
SMILES: CNC(=O)c1ccc(cc1)[C@@H]([C@H](C)Nc1nn(C)c(=O)c2cccnc12)N(C)C
InChI Key: InChIKey=XJCJNZRDKMGHEV-SCLBCKFNSA-N
Data: 1 IC50
Activity Spreadsheet -- Enzyme Inhibition Constant Data from BindingDB
Found 1 hit for monomerid = 311510
Trg + Lig
Ki
nM
ΔG°
kcal/mole
IC50
nM
Kd
nM
EC50/IC50
nM
koff
s-1
kon
M-1s-1
pHTemp
°C
Histone acetyltransferase KAT2B [719-832]
(Homo sapiens (Human))
BDBM311510
(CHEM-US-00230 | US10155764, Example 85)
Show SMILES CNC(=O)c1ccc(cc1)[C@@H]([C@H](C)Nc1nn(C)c(=O)c2cccnc12)N(C)C |r|
Show InChI InChI=1S/C21H26N6O2/c1-13(18(26(3)4)14-8-10-15(11-9-14)20(28)22-2)24-19-17-16(7-6-12-23-17)21(29)27(5)25-19/h6-13,18H,1-5H3,(H,22,28)(H,24,25)/t13-,18+/m0/s1
NCI pathway
Reactome pathway
US Patent
n/an/a 50n/an/an/an/an/an/a
GENENTECH, INC; CONSTELLATION PHARMACEUTICALS, INC.
US Patent
Assay Description
His/Flag epitope tagged PCAF719-832 bromodomain was cloned, expressed and purified to homogeneity in-house. PCAF bromodomain binding and inhibition o...
US Patent US10155764 (2018)
BindingDB Entry DOI: 10.7270/Q25M67T9