null
SMILES: Cn1cc(NC(=O)c2ccc3cnc(N[C@@H]4CCCC[C@@H]4N)nn23)c(n1)C(N)=O
InChI Key: InChIKey=MUBOUHCTUYURRB-NWDGAFQWSA-N
Activity Spreadsheet -- Enzyme Inhibition Constant Data from BindingDB
Found 1 hit for monomerid = 311563
Trg + Lig
Ki
nM
ΔG°
kcal/mole
IC50
nM
Kd
nM
EC50/IC50
nM
koff
s-1
kon
M-1s-1
pHTemp
°C
Interleukin-1 receptor-associated kinase 4
(Homo sapiens (Human))
BDBM311563
(2-{[(1R,2S)-2- aminocyclohexyl]amino}- N-(3-carbam...)
Show SMILES Cn1cc(NC(=O)c2ccc3cnc(N[C@@H]4CCCC[C@@H]4N)nn23)c(n1)C(N)=O |r|
Show InChI InChI=1S/C18H23N9O2/c1-26-9-13(15(24-26)16(20)28)22-17(29)14-7-6-10-8-21-18(25-27(10)14)23-12-5-3-2-4-11(12)19/h6-9,11-12H,2-5,19H2,1H3,(H2,20,28)(H,22,29)(H,23,25)/t11-,12+/m0/s1
Reactome pathway
US Patent
n/an/a 0.700n/an/an/an/an/an/a
Merck Sharp & Dohme Corp.
US Patent
Assay Description
The kinase activity of IRAK4 is determined by its ability to catalyze the phosphorylation of a fluorescent polypeptide substrate. The extent of phosp...
US Patent US10155765 (2018)
BindingDB Entry DOI: 10.7270/Q21V5H2J